program: TURBOMOLE
programVersion: 7.3
elementType: v
basis: def2-TZVP
elementType: o
elementType: c
elementType: h
method: uhf
method: dft
functional: pbe0
elementType: v o c h
basis: def2-TZVP def2-TZVP def2-TZVP def2-TZVP
correction: disp3
energy: -7571.350779523 hartree
formula: C12H37O19V6
InChI: InChI=1/12CH3O.H2O.6O.6V/c12*1-2;;;;;;;;;;;;;/h12*1H3;1H2;;;;;;;;;;;;/q;;;;;;;;;;;;;;;;;;;;;;;;+1/p-1/rC12H37O19V6/c1-20-32(13)21(2)34(15)24(5)33(20,14)25(6)35(16,22(32)3)27(8)36(17,23(32)4,26(34)7)31(12)37(18,19,28(33)9,29(34)10)30(35)11/h18H,1-12H3
74 atoms
V  0.7637791 -2.08003478 -0.67679353
O  1.19602703 -3.53546331 -1.08333557
V  -0.52567979 0.60094896 -2.09293707
O  -0.98714241 0.97646631 -3.5446581
O  -1.19016633 -2.45517893 -0.21878262
O  0.06964657 -1.30130959 -2.36024397
O  -2.276858 -0.18763363 -1.35716227
O  2.43713084 -1.04789139 -0.80651728
O  1.38824215 1.14238835 -2.05473519
O  -0.97135162 2.2803681 -1.07935637
O  -0.04666298 -0.06443797 0.12968285
C  -1.79857989 -3.5638564 -0.82406618
H  -2.88954716 -3.52177271 -0.72777041
H  -1.43307644 -4.48265734 -0.35736646
H  -1.55587299 -3.60229128 -1.88900286
C  0.66872264 -1.58744057 -3.60618998
H  -0.07889757 -1.47588182 -4.39690106
H  1.05185859 -2.61149367 -3.60642668
H  1.49123931 -0.89928104 -3.81793829
C  -3.09247038 -0.87928055 -2.2776963
H  -3.43052285 -0.17370693 -3.0394201
H  -3.95611844 -1.30207579 -1.7573848
H  -2.5265263 -1.67506064 -2.76662651
C  3.43317415 -1.31780268 -1.7690015
H  4.41526176 -1.11157236 -1.33414477
H  3.3113344 -0.68335253 -2.65116566
H  3.38078556 -2.36678667 -2.07136998
C  1.71958002 2.275731 -2.83241469
H  2.76236001 2.55112399 -2.65562305
H  1.07817167 3.12623027 -2.58777028
H  1.58025007 2.0348663 -3.89004246
C  -2.07719158 3.01935281 -1.55125699
H  -2.25564151 3.87569457 -0.89539524
H  -2.98207512 2.40511825 -1.58718527
H  -1.86824547 3.37201227 -2.56499119
V  -0.65078214 2.06871819 0.86532896
O  -1.13668935 3.42467515 1.49064211
V  2.21012483 0.85855846 -0.27058399
O  3.67463595 1.39272715 -0.42071633
V  0.67473603 -0.60410736 2.27162401
O  1.05946348 -1.00515811 3.72616703
O  1.25235591 2.43333184 0.47823701
O  -0.06948427 1.11078946 2.59365658
O  2.25735081 0.23499941 1.69223843
O  -2.33851208 0.95469482 1.04936209
O  -1.13149316 -1.2738971 2.21120453
O  1.19823653 -2.16478565 1.33379417
C  1.58736988 3.76343162 0.14616754
H  2.63421156 3.8143813 -0.16315323
H  0.95535793 4.13915027 -0.66328714
H  1.43403994 4.40037896 1.0220936
C  -0.86133776 1.32518478 3.74676902
H  -0.32358717 0.96821932 4.62867087
H  -1.06961638 2.39240796 3.83386849
H  -1.80323569 0.77653279 3.65313926
C  2.95670623 1.07829257 2.59325248
H  3.10671387 0.55207868 3.5390113
H  3.91646226 1.34224367 2.14738076
H  2.37222387 1.98535631 2.76795341
C  -3.65213356 1.46394382 1.04926918
H  -4.08151699 1.41487534 0.04457938
H  -4.27143731 0.85963766 1.71599412
H  -3.63342717 2.50164272 1.38749106
C  -1.42503534 -2.51740391 2.80706039
H  -2.50903831 -2.64175466 2.84003638
H  -0.97467111 -3.32460829 2.22135992
H  -1.0172106 -2.539313 3.8202703
C  2.40956035 -2.8058219 1.69169384
H  2.47039543 -3.75737982 1.16145954
H  3.25394452 -2.17362634 1.40355005
H  2.42969724 -2.96903063 2.77220021
O  -3.49916382 -1.45197543 0.87925896
V  -1.89670195 -0.77392249 0.40065784
H  -3.72319843 -2.36030167 0.65738904
empdispcorrection: -0.120517941 hartree
energy: -7571.3507795227988
energyOcCorr: -7571.3506513781
s2: 8.81431841
charge: 0.000000
dipole: 27.951905 -29.435986 -1.484081 -4.381586 3.105633 -1.275953 45.245172 -44.487404 0.757768
quadrupole: 4903.629733 -5103.113121 -199.483389 4889.484834 -5095.259466 -205.774632 4930.859161 -5136.049982 -205.190821 37.957815 -29.807378 8.150437 -14.621013 16.460033 1.839020 -20.068742 17.621386 -2.447356
