program: TURBOMOLE
programVersion: 7.3
elementType: v
basis: def2-TZVP
elementType: o
elementType: c
elementType: h
method: uhf
method: dft
functional: pbe0
elementType: v o c h
basis: def2-TZVP def2-TZVP def2-TZVP def2-TZVP
correction: disp3
energy: -7571.970007801 hartree
formula: C12H38O19V6
InChI: InChI=1/12CH3O.H2O.6O.6V/c12*1-2;;;;;;;;;;;;;/h12*1H3;1H2;;;;;;;;;;;;/rC12H38O19V6/c1-20-32(13)21(2)34(15)24(5)33(20,14)25(6)35(16,22(32)3)27(8)36(17,23(32)4,26(34)7)31(12)37(18,19,28(33)9,29(34)10)30(35)11/h18H2,1-12H3
75 atoms
V  0.7496549 -2.11092837 -0.72045952
O  1.25744471 -3.50483612 -1.24176041
V  -0.60659326 0.57120687 -2.11857786
O  -1.00137421 0.98550031 -3.58393878
O  -1.16630704 -2.50139091 -0.267319
O  0.06618178 -1.29460649 -2.41597655
O  -2.31957059 -0.23415331 -1.43224894
O  2.41500455 -0.95264113 -0.89091995
O  1.33143927 1.17904123 -2.04578799
O  -1.05657028 2.24461441 -1.11934336
O  0.02829729 -0.02742299 0.03932519
C  -1.7633631 -3.65799166 -0.77257209
H  -2.85339047 -3.64408837 -0.62876335
H  -1.36541436 -4.54292681 -0.26673779
H  -1.57601008 -3.76129962 -1.84525567
C  0.80362298 -1.49451011 -3.60099468
H  0.17100514 -1.2681399 -4.46415264
H  1.14137005 -2.5333332 -3.65393976
H  1.67756674 -0.83556677 -3.64030346
C  -3.0391975 -0.99848351 -2.36287667
H  -3.42550965 -0.34726197 -3.15220986
H  -3.88724217 -1.50250251 -1.88158686
H  -2.40074445 -1.75786881 -2.82311659
C  3.60525678 -1.35928016 -1.53553209
H  4.46520084 -1.11865266 -0.90567054
H  3.71077684 -0.83727137 -2.49041092
H  3.56551489 -2.43483104 -1.71218663
C  1.63189175 2.34488088 -2.7843168
H  2.68457274 2.60744037 -2.65151715
H  1.00258251 3.17429505 -2.45155813
H  1.42466044 2.15249245 -3.83927229
C  -2.21791103 2.92027335 -1.54065939
H  -2.38528296 3.7971366 -0.90859614
H  -3.09667968 2.26876301 -1.48759951
H  -2.09592737 3.23628683 -2.58092428
V  -0.68181603 2.07068529 0.83656597
O  -1.10321737 3.49230252 1.35783726
V  2.10696817 0.82497248 -0.31823897
O  3.50588822 1.45292633 -0.57703587
V  0.67839673 -0.62618435 2.24739382
O  1.14599375 -1.00397441 3.69914224
O  1.2657058 2.39486856 0.35620786
O  -0.05629398 1.20992703 2.5230546
O  2.34623317 0.27435169 1.49932731
O  -2.35327937 0.98691811 1.03834699
O  -1.20150023 -1.29445869 2.18449984
O  1.19897623 -2.25481391 1.21781282
C  1.74764541 3.72077773 0.32288287
H  2.7988721 3.72607043 0.02605129
H  1.16265404 4.3118147 -0.38570195
H  1.63926656 4.16728726 1.31391968
C  -0.86735426 1.38517425 3.66464126
H  -0.32153348 1.04871238 4.55040151
H  -1.12356556 2.44313394 3.77020111
H  -1.7896044 0.80111158 3.58080649
C  3.0389252 1.11518706 2.40107365
H  3.25870302 0.54851709 3.3077185
H  3.96640374 1.46358282 1.93903834
H  2.41230235 1.97318642 2.65984645
C  -3.64944676 1.48241342 1.19621993
H  -4.24296123 1.33710527 0.28128299
H  -4.14897467 0.98380441 2.0367533
H  -3.62355347 2.55461019 1.40479154
C  -1.46224142 -2.55696179 2.74749452
H  -2.5335431 -2.77751421 2.69200774
H  -0.90224835 -3.33280839 2.21688542
H  -1.15703234 -2.55587839 3.7970545
C  2.45008174 -2.81874679 1.54572049
H  2.58835238 -3.74880212 0.98738241
H  3.26769651 -2.13231486 1.30042749
H  2.48381582 -3.02466891 2.61900037
O  -3.82548629 -1.54603359 0.80267378
V  -1.83522778 -0.78677149 0.40544144
H  -4.54089741 -0.95255173 0.55125358
H  -4.04059131 -2.41680905 0.45372222
empdispcorrection: -0.121656747 hartree
energy: -7571.9700078006117
energyOcCorr: -7571.9698827116
s2: 12.06333974
charge: 0.000000
dipole: 12.964273 -15.541876 -2.577603 -13.031263 12.208321 -0.822942 19.266853 -19.691259 -0.424405
quadrupole: 5094.363522 -5264.880906 -170.517384 4962.398906 -5171.968290 -209.569384 4821.299023 -5044.822015 -223.522992 59.562798 -41.121165 18.441633 -33.417546 27.011623 -6.405924 22.413942 -22.591916 -0.177973
