program: TURBOMOLE
programVersion: 7.3
elementType: v
basis: def2-TZVP
elementType: o
elementType: c
elementType: h
method: uhf
method: dft
functional: pbe0
elementType: v o c h
basis: def2-TZVP def2-TZVP def2-TZVP def2-TZVP
correction: disp3
energy: -7571.500675929 hartree
formula: C12H37O19V6
InChI: InChI=1/12CH3O.H2O.6O.6V/c12*1-2;;;;;;;;;;;;;/h12*1H3;1H2;;;;;;;;;;;;/q;;;;;;;;;;;;;;;;;;;;;;;;+1/p-1/rC12H37O19V6/c1-20-32(13)21(2)34(15)24(5)33(20,14)25(6)35(16,22(32)3)27(8)36(17,23(32)4,26(34)7)31(12)37(18,19,28(33)9,29(34)10)30(35)11/h18H,1-12H3
74 atoms
V  0.73779071 -2.10045297 -0.67189853
O  1.24145021 -3.53960471 -1.08799817
V  -0.55260138 0.58182997 -2.09311547
O  -0.93849523 0.99335421 -3.56572209
O  -1.15549555 -2.5286261 -0.21107282
O  0.05491958 -1.32624257 -2.36908697
O  -2.2792584 -0.16201774 -1.42421904
O  2.43611374 -1.06771848 -0.81149318
O  1.38947965 1.12191946 -2.06980878
O  -0.98436001 2.2837202 -1.09662807
O  0.03855978 -0.03797799 0.13140325
C  -1.7829551 -3.56388519 -0.90467764
H  -2.86712767 -3.53366621 -0.74243481
H  -1.39542505 -4.53220281 -0.56455207
H  -1.60136317 -3.49386002 -1.98314802
C  0.68981953 -1.58913307 -3.59426748
H  -0.03696038 -1.48323011 -4.40715196
H  1.09202157 -2.60744047 -3.59451838
H  1.50700451 -0.88541405 -3.78067681
C  -3.07873329 -0.86779286 -2.33463458
H  -3.46367163 -0.17585133 -3.09227448
H  -3.91500756 -1.33016137 -1.80075909
H  -2.50416181 -1.64505385 -2.84836918
C  3.44359784 -1.33959187 -1.74536011
H  4.42102886 -1.12176266 -1.29998549
H  3.33909039 -0.71638381 -2.64010956
H  3.40313876 -2.39323636 -2.03969
C  1.70971083 2.26422631 -2.82249419
H  2.75257722 2.545988 -2.64456566
H  1.06418868 3.10879808 -2.56271829
H  1.56551398 2.04576539 -3.88614957
C  -2.12976136 2.96197113 -1.54995009
H  -2.34194737 3.8123745 -0.89385235
H  -3.00171412 2.30137319 -1.56838618
H  -1.95458303 3.32128499 -2.56978629
V  -0.67328704 2.07002729 0.85395356
O  -1.06960438 3.46797743 1.47390422
V  2.16191935 0.83191457 -0.2696777
O  3.64072856 1.36801726 -0.41444044
V  0.65032894 -0.60908096 2.25445511
O  1.06931428 -1.0037178 3.71227874
O  1.25574111 2.43797844 0.46465622
O  -0.07185467 1.11894606 2.59228348
O  2.26444721 0.22752491 1.69652253
O  -2.34664567 1.05214229 1.09738077
O  -1.11665676 -1.29289339 2.25080851
O  1.20205893 -2.18584834 1.33956957
C  1.61187767 3.75468702 0.14712484
H  2.66375935 3.7939789 -0.15374344
H  0.99448781 4.15112556 -0.66630494
H  1.45779043 4.39431357 1.02349799
C  -0.87567055 1.31951348 3.73098173
H  -0.35316116 0.94795513 4.61819048
H  -1.08345188 2.38728946 3.82998839
H  -1.81972108 0.77805919 3.61452118
C  2.94714064 1.07510108 2.58965428
H  3.10116188 0.55563868 3.5407161
H  3.90585366 1.35313906 2.14624306
H  2.35467917 1.97870742 2.76442081
C  -3.64951326 1.55811058 1.10031657
H  -4.11447068 1.47452702 0.11135846
H  -4.26353692 0.98016431 1.79846789
H  -3.63883497 2.61168467 1.40050205
C  -1.39799575 -2.5342182 2.83790638
H  -2.48284732 -2.66150835 2.88831156
H  -0.96142782 -3.33689249 2.23425682
H  -0.97487722 -2.57275699 3.84701948
C  2.42600624 -2.7892169 1.68602063
H  2.51301731 -3.73835533 1.15246684
H  3.25465472 -2.13553836 1.39616075
H  2.45921853 -2.95402994 2.76767921
O  -3.66835946 -1.40818915 0.81598008
V  -1.94044204 -0.78766139 0.42059273
H  -3.74395982 -2.35271007 0.96922922
empdispcorrection: -0.119993273 hartree
energy: -7571.5006759291527
energyOcCorr: -7571.5035198198
s2: 12.06106499
charge: -1.000000
dipole: 21.418234 -21.287749 0.130484 -7.158374 6.375714 -0.782660 43.031427 -42.204214 0.827213
quadrupole: 4933.391500 -5166.047701 -232.656201 4915.045859 -5144.407151 -229.361291 4950.654657 -5175.400145 -224.745488 1.002319 3.016159 4.018478 -12.786474 14.159998 1.373524 0.072408 -3.975731 -3.903323
