program: TURBOMOLE
programVersion: 7.3
elementType: v
basis: def2-TZVP
elementType: o
elementType: c
elementType: h
method: uhf
method: dft
functional: pbe0
elementType: v o c h
basis: def2-TZVP def2-TZVP def2-TZVP def2-TZVP
correction: disp3
energy: -7572.122245941 hartree
formula: C12H38O19V6
InChI: InChI=1/12CH3O.H2O.6O.6V/c12*1-2;;;;;;;;;;;;;/h12*1H3;1H2;;;;;;;;;;;;/rC12H38O19V6/c1-20-32(13)21(2)34(15)24(5)33(20,14)25(6)35(16,22(32)3)27(8)36(17,23(32)4,26(34)7)31(12)37(18,19,28(33)9,29(34)10)30(35)11/h18H2,1-12H3
75 atoms
V  0.94783802 -2.12870656 0.34851896
O  1.521856 -3.58966048 0.53082639
V  0.94096163 0.09311296 -2.10537737
O  1.55547339 0.14202185 -3.5623447
O  -0.85777296 -2.59830157 -0.47810791
O  1.54418569 -1.72530792 -1.5253858
O  -0.86025826 -0.7724061 -2.55836139
O  2.36702907 -0.96440682 1.08587337
O  2.42086075 0.84810997 -1.005537
O  0.0106585 1.87656176 -2.028986
O  -0.05240508 -0.03098829 -0.01275159
C  -1.32938628 -3.90892746 -0.5090285
H  -2.40356945 -3.93378605 -0.73362161
H  -1.16949064 -4.40045296 0.45576652
H  -0.79596438 -4.49071593 -1.271125
C  2.797896 -2.13950326 -1.99596852
H  2.75216681 -2.2757673 -3.08290688
H  3.08005749 -3.08496038 -1.5212931
H  3.57111549 -1.39319795 -1.7858605
C  -0.7762558 -1.85863057 -3.42674605
H  -0.249218 -1.56785958 -4.34135119
H  -1.779783 -2.21100343 -3.73500263
H  -0.2443691 -2.69679154 -2.96483473
C  3.72789603 -1.29794719 1.07192178
H  4.20679454 -0.90572194 1.97599122
H  4.23882183 -0.86116906 0.20699982
H  3.84597878 -2.38585106 1.04099589
C  3.21078153 1.83263268 -1.61889356
H  3.89980296 2.26538121 -0.88653615
H  2.59670808 2.63278526 -2.04491549
H  3.78480081 1.38023066 -2.43595814
C  -0.68321443 2.25494901 -3.18894574
H  -1.09244317 3.26292361 -3.0602451
H  -1.50841191 1.56453139 -3.40060946
H  0.0007958 2.24075761 -4.0442736
V  -0.94746353 2.12393056 -0.28177999
O  -1.62310906 3.53825951 -0.48894631
V  1.90142475 0.98242131 0.93599793
O  3.19592024 1.62891886 1.56262688
V  -0.96837272 -0.10552476 2.18755794
O  -1.63861995 -0.20642662 3.61437357
O  0.79507939 2.60109678 0.52819979
O  -1.62218266 1.67622554 1.55219129
O  0.7665061 0.77070329 2.57370138
O  -2.41529305 0.93043183 -1.03678429
O  -2.45112573 -0.92227903 1.04891319
O  -0.00902249 -1.86554986 2.09080608
C  1.34072337 3.85068488 0.20526092
H  2.35515087 3.92837835 0.60845186
H  1.37621376 4.00462442 -0.87879395
H  0.71754972 4.64251497 0.63666715
C  -2.94611674 1.99777141 1.87968656
H  -3.06283789 1.99545151 2.96891723
H  -3.19400724 2.98980232 1.48721251
H  -3.64981196 1.2652608 1.46606942
C  0.72169492 1.87458506 3.44653354
H  0.21127552 1.58306438 4.37057948
H  1.74360491 2.19401303 3.67521105
H  0.18134693 2.71092803 2.99307522
C  -3.69815224 1.32694478 -1.37509536
H  -3.92250726 1.08888087 -2.43064114
H  -4.45444334 0.84823857 -0.73155431
H  -3.8100312 2.40955355 -1.2622341
C  -3.11051428 -2.0326638 1.59173557
H  -3.7912024 -2.47525012 0.85408236
H  -2.38867516 -2.792867 1.90710695
H  -3.68624065 -1.72129602 2.46960203
C  0.71180072 -2.21932582 3.24824292
H  1.12437176 -3.22652543 3.12571117
H  1.5335917 -1.5188927 3.42467645
H  0.03962958 -2.19841273 4.11261228
O  -3.50519602 -1.74796661 -1.69746353
V  -1.70560653 -0.87980005 -0.7564243
H  -4.07278609 -1.0049327 -1.93447154
H  -3.18962724 -2.11793556 -2.5314887
empdispcorrection: -0.121256103 hartree
energy: -7572.1222459411529
energyOcCorr: -7572.1251483611
s2: 15.82215311
charge: -1.000000
dipole: -19.615512 16.354809 -3.260703 -14.164244 12.774981 -1.389263 -4.209701 1.729521 -2.480180
quadrupole: 5174.908649 -5387.545058 -212.636409 4998.591290 -5233.500318 -234.909028 4822.794326 -5058.431397 -235.637071 41.096628 -31.037544 10.059083 0.577987 14.627026 15.205013 29.532716 -22.638717 6.893999
