program: TURBOMOLE
programVersion: 7.3
title: Local memory allocated for RDGRAD: 8 MiB
elementType: v
basis: def2-TZVP
elementType: o
elementType: ti
elementType: c
elementType: h
method: uhf
method: dft
functional: pbe0
elementType: v o ti c h
basis: def2-TZVP def2-TZVP def2-TZVP def2-TZVP def2-TZVP
correction: disp3
frequency: -0.00 -0.00 -0.00 -0.00 0.0000 0.0000 100.00 100.00 100.00 100.00 100.00 100.00 100.00 100.09 109.75 114.03 115.37 117.67 119.02 120.72 123.00 123.93 125.18 127.90 128.96 131.54 137.01 140.47 146.47 147.37 158.19 160.96 167.31 172.46 174.36 175.06 181.05 182.48 184.27 188.33 189.86 191.35 192.49 194.31 196.01 196.92 197.98 199.04 203.05 206.94 207.54 209.36 213.15 213.79 216.73 219.88 222.00 223.09 226.15 232.12 233.30 235.98 237.29 238.81 242.50 246.79 248.77 253.08 255.02 262.51 265.73 291.34 296.93 308.73 310.45 316.54 318.94 322.30 330.90 335.91 341.19 343.02 346.17 371.69 401.09 409.86 413.57 414.82 417.75 439.98 442.30 445.85 454.94 464.32 466.96 473.76 485.73 486.52 490.40 494.77 497.53 500.48 507.30 537.48 588.26 598.13 599.35 605.45 616.57 1059.40 1059.75 1061.58 1066.49 1070.52 1092.34 1097.99 1099.31 1104.89 1107.22 1107.73 1115.69 1117.86 1119.97 1132.63 1139.80 1154.32 1173.20 1174.47 1175.10 1175.71 1177.26 1177.79 1178.36 1179.26 1179.65 1180.46 1181.76 1181.94 1183.45 1184.80 1197.18 1199.25 1199.62 1200.74 1204.86 1205.36 1206.18 1206.89 1207.17 1208.04 1208.32 1208.85 1234.17 1455.32 1457.43 1459.46 1459.90 1460.56 1461.22 1461.79 1463.41 1465.08 1466.53 1469.57 1470.26 1472.50 1472.87 1475.91 1476.57 1477.49 1478.34 1479.53 1480.68 1482.41 1482.98 1484.00 1485.54 1487.34 1488.00 1488.52 1489.90 1490.44 1491.59 1493.00 1499.89 1501.55 1502.82 1504.87 1505.81 1508.57 1512.34 1513.90 2974.75 2999.98 3006.74 3007.12 3008.10 3009.10 3009.49 3011.14 3012.23 3013.71 3014.23 3015.59 3018.40 3030.04 3037.41 3058.09 3067.23 3069.44 3075.48 3075.64 3075.77 3077.53 3082.14 3084.08 3084.34 3085.83 3086.65 3087.67 3087.90 3088.56 3088.73 3091.46 3091.68 3092.76 3094.69 3095.14 3096.63 3098.35 3098.61
irintensity: 0.00000 0.00000 0.00000 0.00000 0 0 1.62919 0.08604 1.53845 0.00438 1.18797 0.33945 0.31483 0.13523 0.05337 0.26912 0.54825 0.73809 0.42696 0.26670 0.15217 0.66989 0.47684 0.15775 0.78170 0.44450 0.22598 0.15435 0.22285 0.18067 0.62753 0.41689 0.03406 0.33285 0.58521 0.13471 0.54149 0.19897 2.36403 2.51727 3.02713 0.84821 1.90362 1.31744 0.71701 0.80051 1.58664 0.31598 0.57973 1.36482 1.06317 0.13971 0.93806 1.76524 0.79835 1.44477 0.77042 1.33086 1.71520 2.19136 2.35142 0.46204 1.16707 2.01854 1.31752 0.87089 1.61628 0.85030 2.85575 5.93568 4.67630 1.23862 0.38525 1.02186 3.57280 2.00426 0.03068 6.76434 0.11881 0.57811 0.13601 0.45375 1.56865 6.56498 28.09323 17.32257 11.85911 28.93222 31.64802 139.12646 166.55585 128.55481 15.91265 5.78985 4.38356 24.17667 3.68455 2.95237 3.00621 5.49323 1.23356 1.08180 1.27408 87.23838 186.78470 546.01118 147.71605 760.21269 1058.78424 174.72316 210.77855 40.62390 23.24978 53.39462 76.94346 151.28187 22.60500 33.68927 122.69489 118.14159 312.18425 109.10989 350.81977 528.64758 478.04681 18.52604 1.11837 1.79322 1.43957 0.09146 3.01208 0.94448 0.52533 0.80079 2.70649 3.08159 0.14407 0.21712 0.27547 0.02074 4.31346 4.36213 8.42111 5.23633 1.00957 0.91559 0.31159 0.87084 0.24751 0.09820 2.74162 1.68806 575.75629 0.52231 0.57336 0.03539 0.56021 0.02329 0.14846 0.09845 0.14120 0.20706 0.73260 2.00639 0.47406 1.74224 2.22212 2.81705 6.15646 4.10720 3.64394 6.03581 2.67448 5.68613 1.25781 4.60858 5.01276 2.96009 3.21577 3.35815 2.53676 3.11196 5.75090 6.19332 6.35831 3.11244 2.95165 0.21272 7.32634 8.25710 6.37547 4.17071 148.57092 61.95952 36.66614 16.83448 59.28490 20.62327 142.50707 98.43277 88.08768 267.99572 109.52290 104.70357 74.25876 44.18508 44.58785 48.83995 44.17866 59.54952 39.55614 49.03588 13.32684 10.83753 15.04933 8.61176 30.36952 11.62210 18.62575 13.57098 15.96638 30.78875 28.82270 8.90607 25.59509 6.35168 48.72677 5.95214 38.80789 14.09643 21.90615
energy: -7516.259029298 hartree
formula: C13H39O19TiV5
InChI: InChI=1/13CH3O.6O.Ti.5V/c13*1-2;;;;;;;;;;;;/h13*1H3;;;;;;;;;;;;/q;;;;;;;;;;;;-1;;;;;;;+1;;;;;/rC13H39O19TiV5/c1-20-33(14)21(2)34(15)25(6)35(16,22(33)3)27(8)37(18,24(33)5)28(9)36(17,23(33)4,26(34)7)31(12)38(19,29(34)10,30(35)11)32(37)13/h1-13H3
77 atoms
V  2.29705366 0.23495974 0.47977413
O  3.84386505 0.24907057 0.78716854
Ti 0.11778926 -2.00890166 -0.13032379
V  0.42816929 0.30566443 -2.28570561
O  0.72504708 0.42256384 -3.83147642
O  2.02177937 -1.76763897 0.2581268
O  2.2848592 0.31970225 -1.52656245
O  0.47877466 -1.70463075 -2.06849186
O  1.75744587 2.14027604 0.56304268
O  0.27543413 2.22373052 -1.73614571
O  -1.58537753 0.19854051 -2.27793201
O  -0.01592141 -0.07210742 -0.00723004
C  3.0951173 -2.65944435 0.30126274
H  2.74297387 -3.67539739 0.09512773
H  3.56862503 -2.63521745 1.28846669
H  3.85104725 -2.38392256 -0.44149277
C  3.21443304 1.11531671 -2.21487538
H  3.36594009 0.70811711 -3.22088557
H  4.16804935 1.1225143 -1.67709452
H  2.85924246 2.14529523 -2.32046416
C  1.48935181 -2.38516334 -2.76097736
H  1.34922567 -2.24490572 -3.83749111
H  1.45070252 -3.45342449 -2.52176788
H  2.47499858 -1.99578897 -2.48559169
C  2.63545087 3.19582524 0.26934939
H  2.47799289 4.00808052 0.98765022
H  2.45711273 3.59550972 -0.73445891
H  3.67178696 2.85159788 0.33540885
C  -0.33031123 3.0568059 -2.6953039
H  -0.45024981 4.06573845 -2.28805328
H  -1.31044373 2.67369999 -2.99421749
H  0.30304649 3.09713391 -3.58816939
C  -2.14155465 -0.61362197 -3.28163199
H  -3.23430605 -0.58712242 -3.21427546
H  -1.80594326 -1.6521875 -3.184087
H  -1.82565694 -0.24593668 -4.26368688
V  -2.34110236 -0.00251885 -0.42532652
O  -3.8910068 -0.09136438 -0.70616193
V  -0.18168091 2.47531702 0.20191402
O  -0.25928624 4.03969848 0.34706515
V  -0.47019311 -0.08556341 2.35690945
O  -0.75677912 -0.23648524 3.90071042
O  -2.06204772 1.95220305 -0.2044528
O  -2.30997689 -0.19970839 1.57130835
O  -0.57547438 1.87779382 2.06604691
O  -1.81166713 -1.95330247 -0.50711837
O  -0.22520697 -2.02352747 1.82993986
O  1.52536592 0.08553582 2.3211459
C  -3.0041658 2.80961565 -0.79250301
H  -2.65774137 3.84534313 -0.72947278
H  -3.17401377 2.55486559 -1.84421718
H  -3.9608766 2.71708977 -0.26602228
C  -3.15008221 -1.17819887 2.12886379
H  -3.23355371 -1.01248393 3.20810672
H  -4.14246166 -1.11533633 1.67052019
H  -2.74810733 -2.18490778 1.96816782
C  -1.66276756 2.5202211 2.69455895
H  -1.66940558 2.25764478 3.75716119
H  -1.5537324 3.60380958 2.58457506
H  -2.61186363 2.20945324 2.24872321
C  -2.64352335 -3.0296309 -0.82289022
H  -2.25258882 -3.57704184 -1.68855759
H  -2.70880437 -3.72457676 0.02309857
H  -3.64775498 -2.66573597 -1.05605101
C  0.5274503 -2.81792699 2.7075664
H  0.62063567 -3.83226672 2.30460504
H  1.52781402 -2.3948453 2.84444618
H  0.02802265 -2.85445309 3.6806327
C  2.06999464 0.9569079 3.28600776
H  3.16225407 0.88156685 3.26713886
H  1.78164005 1.992472 3.08302582
H  1.69854288 0.67583055 4.2767117
O  0.22892192 -3.81295572 -0.26142379
C  0.11882032 -5.17987257 -0.35366031
H  -0.88515857 -5.51752406 -0.06385007
H  0.30455449 -5.52386522 -1.38068448
H  0.8434022 -5.67953061 0.30448891
converged: yes
empdispcorrection: -0.123928213 hartree
orbitalenergy: -3.4322 -3.2560 -3.1850 -3.1187 -2.6758 1.0720 1.1615 1.3738 1.8272 1.8734 electronvolt
orbitalenergy: -4.8181 -4.7853 -4.7188 -4.5275 -4.4675 1.0854 1.1792 1.3747 2.3999 2.4553 electronvolt
s2: 8.81723717
charge: -1.000000
dipole: -7.998732 8.166516 0.167784 -5.445504 3.565304 -1.880200 -11.849682 11.327538 -0.522144
quadrupole: 5029.304750 -5268.680348 -239.375598 5869.613593 -6092.230324 -222.616731 4863.030057 -5106.435722 -243.405665 -17.752819 17.389795 -0.363025 -14.705343 15.119690 0.414347 -5.029826 5.146424 0.116598
