program: TURBOMOLE
programVersion: 7.3
title: Local memory allocated for RDGRAD: 8 MiB
elementType: v
basis: def2-TZVP
elementType: o
elementType: ti
elementType: c
elementType: h
method: uhf
method: dft
functional: pbe0
elementType: v o ti c h
basis: def2-TZVP def2-TZVP def2-TZVP def2-TZVP def2-TZVP
correction: disp3
frequency: -0.00 -0.00 -0.00 0.0000 0.0000 0.0000 100.00 100.00 100.00 100.00 100.00 100.00 100.00 100.00 100.00 100.00 100.00 100.00 105.83 108.40 109.96 114.14 115.70 118.57 124.40 126.33 128.47 129.74 133.11 138.11 139.10 145.96 154.71 160.80 165.86 169.22 169.90 173.81 174.99 176.48 178.23 181.19 182.83 184.10 184.50 185.55 188.38 189.15 190.30 198.40 200.13 200.34 204.54 205.82 211.64 213.88 214.70 218.11 221.69 223.68 226.83 231.42 232.87 235.21 239.62 242.91 248.59 251.85 256.42 259.77 262.57 265.02 269.07 278.22 300.18 308.35 310.38 317.22 321.91 332.57 334.81 339.96 343.61 353.87 359.21 365.96 393.60 400.89 409.56 412.84 416.69 427.07 437.30 444.07 447.61 450.71 455.30 459.74 470.32 480.34 485.29 486.77 496.40 504.82 525.89 529.90 563.13 581.28 595.63 610.05 625.85 628.75 637.49 1038.69 1047.89 1058.32 1067.11 1072.80 1076.28 1090.92 1092.72 1095.79 1099.17 1106.07 1110.44 1114.02 1120.81 1131.34 1145.49 1164.54 1164.72 1165.91 1166.21 1166.36 1168.00 1168.41 1169.35 1169.82 1170.27 1170.56 1170.61 1171.09 1175.90 1192.42 1194.56 1195.04 1196.12 1196.80 1200.37 1201.85 1202.22 1203.96 1204.13 1204.95 1205.64 1210.24 1459.06 1459.85 1460.31 1460.58 1462.22 1463.49 1464.36 1467.28 1467.83 1470.16 1471.72 1474.21 1476.95 1477.67 1479.07 1480.30 1483.68 1484.01 1484.88 1485.47 1485.59 1486.82 1487.02 1488.06 1488.94 1490.67 1491.21 1492.14 1492.42 1493.58 1495.02 1496.76 1498.03 1499.36 1501.24 1502.37 1504.49 1508.15 1508.89 1639.65 3001.92 3005.15 3007.74 3025.24 3027.18 3029.38 3034.33 3035.53 3036.27 3043.08 3044.90 3047.99 3050.10 3066.32 3071.98 3072.39 3096.00 3099.25 3107.42 3107.60 3108.14 3109.64 3110.72 3112.76 3117.18 3121.57 3122.33 3126.88 3127.77 3128.01 3128.16 3129.39 3132.66 3135.70 3135.74 3140.38 3150.49 3150.93 3154.63 3821.37 3911.97
irintensity: 0.00000 0.00000 0.00000 0 0 0 1.53409 0.36269 0.74771 8.05337 0.82526 0.58277 0.39090 3.98350 1.28069 0.32318 0.69377 0.20170 4.74100 2.61714 4.71028 1.98656 1.40014 0.17625 0.73627 0.84828 0.14450 1.59147 0.67473 0.41686 1.99298 0.06878 1.04979 0.18352 0.46764 0.41271 1.94600 0.41158 0.74449 0.83700 0.78769 0.89870 1.94471 0.47185 1.40604 4.91497 2.46485 0.36648 0.42476 0.66103 1.32233 2.24797 0.17079 2.65588 0.51199 0.69070 0.50412 0.92912 0.28234 1.15298 1.26557 0.76297 6.47741 2.91523 5.13469 0.04611 2.07901 2.33886 0.78541 1.31760 1.18626 0.40702 27.34371 4.75510 102.92275 31.25511 4.24189 10.91954 0.88000 5.94387 3.12021 3.03461 0.81148 1.13465 1.57252 0.23525 16.28145 11.20643 11.68205 40.08628 10.51704 21.70374 75.95494 105.17645 133.79514 60.06556 9.78596 29.90041 11.75404 12.79781 20.56747 27.57411 6.92826 1.33073 1.30391 3.38180 4.85161 50.66295 286.13936 66.21558 916.46380 873.53988 331.79490 55.25527 120.42027 77.74470 129.69028 34.87192 34.53372 21.43763 29.29209 64.26135 38.02892 161.19326 257.46037 644.10237 390.20805 561.50032 100.62142 3.99505 3.86378 1.90105 2.85979 1.31747 1.77804 1.86199 1.71938 1.00570 0.72749 4.36008 1.21411 0.22404 0.19849 1.93246 8.44864 10.30268 7.52573 0.67982 3.55122 4.73248 0.46262 5.37128 13.60670 4.29086 0.91538 476.15057 3.00637 0.41179 6.45995 1.80512 0.55510 0.61279 1.17522 1.01506 0.39726 0.08681 0.29453 1.50516 0.80776 0.83496 8.91124 8.81623 5.95963 7.99189 4.39721 6.44212 8.80714 7.92887 5.54969 13.53624 2.51112 11.87040 3.42877 7.67315 14.33438 8.24355 1.62054 5.86640 5.20257 11.96343 11.58727 9.97775 7.99212 3.35339 2.01538 134.56421 29.99848 16.58994 143.52437 36.99679 22.44750 83.67576 46.27508 67.05065 47.07962 21.77042 31.31410 22.20947 23.29846 37.82622 49.23676 4.26808 36.20108 10.27760 10.30975 20.16111 11.18354 6.96518 25.71372 17.87434 6.61059 6.92620 9.67305 2.10295 3.81103 7.62499 8.98801 8.16161 4.94387 3.95867 4.57198 8.55821 2.86933 3.34714 2.83230 69.49124 111.74027
energy: -7517.137539122 hartree
formula: C13H41O19TiV5
InChI: InChI=1/13CH3O.H2O.5O.Ti.5V/c13*1-2;;;;;;;;;;;;/h13*1H3;1H2;;;;;;;;;;;/q;;;;;;;;;;;;-1;;;;;;;+1;;;;;/rC13H41O19TiV5/c1-19-33-20-38(18,24(33)5)30(11)35(15,22(33)3)25(6)34(14,21(33)2)26(7)36(16,23(33)4,31(38)12)29(10)37(17,27(34)8,28(35)9)32(38)13/h18H2,1-13H3
79 atoms
V  -0.75138456 -0.24288489 -2.22170213
O  -1.24479684 -0.27812109 -3.70542371
Ti -0.33650681 2.07381629 -0.01910786
V  2.23757167 0.26903357 -0.8496167
O  3.66380846 0.52961396 -1.3921384
O  -0.93610761 1.74341726 -1.84651322
O  1.25962053 0.04358247 -2.45559683
O  1.55044565 2.08415837 -0.79273284
O  -0.25217094 -2.11480722 -1.83414762
O  2.24305116 -1.60336528 -0.64031963
O  2.53764649 0.41741143 1.01391826
O  -0.01223974 0.05418933 0.00111703
C  -1.85668403 2.49390965 -2.60858639
H  -1.83914056 3.53840635 -2.2882647
H  -2.86837949 2.09780278 -2.48287016
H  -1.5920746 2.43059332 -3.66566911
C  1.86636004 -0.67922943 -3.52431248
H  2.87266581 -0.29284047 -3.69690158
H  1.25451173 -0.55528243 -4.41804224
H  1.91899992 -1.73740917 -3.25822337
C  1.86289668 2.94802922 -1.87491141
H  2.94573866 2.97984713 -2.0095717
H  1.48886527 3.94862915 -1.65278907
H  1.3917476 2.57852511 -2.78912454
C  -1.04901953 -3.16043755 -2.36113602
H  -1.9181733 -3.35092091 -1.72451293
H  -0.45357118 -4.07457986 -2.41207609
H  -1.39276617 -2.89235534 -3.36261574
C  3.4231922 -2.2281815 -0.13642863
H  3.32538903 -3.30571124 -0.26766817
H  3.52876194 -1.99307143 0.92497445
H  4.28950067 -1.85631047 -0.68644219
C  3.47266771 1.37467412 1.49365371
H  3.61791982 1.2176085 2.56259425
H  3.08911919 2.38334669 1.31765957
H  4.41868258 1.25420941 0.96206912
V  0.8886428 0.05968384 2.18345618
O  1.49689027 0.18879341 3.61817435
V  0.48987568 -2.4354953 -0.0134773
O  0.81627108 -3.95961925 -0.05210713
V  -1.85954388 -0.45618278 0.72032188
O  -3.830567 -0.86142103 1.49351229
O  1.07395384 -1.872123 1.79951731
O  -1.06448902 -0.27332569 2.49966686
O  -1.40975852 -2.33784867 0.64997454
O  0.4151046 1.98579552 1.77713399
O  -2.11216409 1.53285426 0.70522304
O  -2.44420904 -0.46848471 -1.15650217
C  0.79879544 -2.73671254 2.88964855
H  0.97152191 -3.77194885 2.58715059
H  1.46130603 -2.48575585 3.72084474
H  -0.23629476 -2.62363525 3.22425804
C  -1.71150445 0.359978 3.58062025
H  -2.6898948 -0.09824695 3.74994383
H  -1.10963718 0.2508462 4.485268
H  -1.84809251 1.42657462 3.37295071
C  -2.10396801 -3.40077327 1.26157581
H  -2.96334161 -3.69873342 0.64735838
H  -1.45252335 -4.2703771 1.36050552
H  -2.45023836 -3.11445436 2.2603799
C  0.5258154 3.05543853 2.69318207
H  1.1544182 3.84578522 2.27354571
H  -0.46238916 3.47197094 2.91028161
H  0.97351372 2.69895529 3.62179142
C  -3.33852787 2.19772981 0.55777793
H  -3.17790227 3.24486477 0.29096361
H  -3.94001444 1.73524748 -0.23262391
H  -3.89516567 2.17775166 1.50289219
C  -3.64582785 -0.98263991 -1.67499449
H  -3.65312985 -0.89395877 -2.76331746
H  -3.76790287 -2.0417556 -1.42018994
H  -4.50380058 -0.42628268 -1.28042844
O  -0.59688971 3.81229275 -0.0231145
C  -0.68793954 5.19880534 0.08441309
H  -1.17710142 5.47249414 1.0235131
H  0.31124119 5.64333219 0.06700408
H  -1.26798024 5.60395417 -0.74964757
H  -4.49643654 -0.16810795 1.53837956
H  -4.28285022 -1.67779364 1.2575719
converged: yes
empdispcorrection: -0.125164801 hartree
orbitalenergy: -9.7316 -9.5994 -9.1973 -8.9790 -8.8041 -6.0530 -5.0595 -4.9963 -4.9752 -4.7858 electronvolt
orbitalenergy: -10.8472 -10.8216 -10.6727 -10.4376 -10.3775 -5.9623 -5.0086 -4.9574 -4.8367 -4.6632 electronvolt
s2: 8.80364171
charge: 1.000000
dipole: -15.391059 12.292346 -3.098713 17.741151 -15.925930 1.815222 -0.987803 1.719123 0.731320
quadrupole: 5189.495952 -5351.548882 -162.052929 5848.073896 -6021.614901 -173.541005 4870.488746 -5070.638299 -200.149553 -15.836656 20.588204 4.751548 -11.949109 0.702612 -11.246497 22.345795 -23.567375 -1.221580
