program: TURBOMOLE
programVersion: 7.3
title: Local memory allocated for RDGRAD: 8 MiB
elementType: v
basis: def2-TZVP
elementType: o
elementType: ti
elementType: c
elementType: h
method: uhf
method: dft
functional: pbe0
elementType: v o ti c h
basis: def2-TZVP def2-TZVP def2-TZVP def2-TZVP def2-TZVP
correction: disp3
frequency: -0.00 0.0000 0.0000 0.0000 0.0000 0.0000 6.18 100.00 100.00 100.00 100.00 100.00 100.00 100.00 103.24 104.97 110.40 115.47 115.88 119.16 121.48 123.54 125.51 126.40 127.91 129.39 129.96 131.27 132.46 141.89 159.10 161.28 168.01 168.72 173.01 174.84 177.59 179.62 180.53 183.65 184.55 188.69 192.76 193.17 195.32 198.90 201.32 202.42 203.76 206.75 207.95 210.88 213.38 217.33 219.82 220.85 224.02 227.68 231.65 232.54 234.99 235.37 239.84 241.75 245.10 247.82 251.12 251.79 257.87 260.48 266.99 268.76 289.96 299.45 303.88 309.56 316.33 318.22 322.28 332.15 344.10 347.52 353.67 376.90 381.48 403.39 408.52 420.69 423.99 425.29 437.48 444.30 450.49 452.92 456.32 459.22 469.00 472.93 483.60 492.91 495.76 503.17 515.13 516.32 564.90 581.65 593.95 605.69 613.26 616.04 665.10 693.10 1059.97 1069.17 1072.95 1079.57 1079.85 1082.11 1092.34 1093.37 1096.13 1100.39 1103.40 1106.40 1114.93 1119.34 1125.55 1141.12 1167.54 1169.56 1169.72 1170.49 1171.21 1171.64 1173.08 1173.45 1174.79 1176.09 1180.66 1180.90 1181.37 1181.52 1195.87 1196.56 1197.89 1198.92 1199.42 1200.01 1201.32 1202.48 1204.97 1205.90 1206.02 1206.44 1224.94 1457.68 1458.53 1459.60 1459.81 1461.32 1463.31 1465.07 1466.49 1468.41 1469.29 1470.41 1470.82 1473.40 1475.14 1478.02 1478.81 1480.82 1481.17 1482.81 1483.20 1484.00 1484.41 1485.42 1486.50 1487.28 1488.29 1490.36 1491.18 1492.69 1493.10 1494.41 1496.16 1499.23 1502.47 1504.37 1504.86 1508.56 1509.73 1512.80 3007.84 3009.54 3018.28 3018.87 3020.56 3023.21 3025.65 3027.21 3031.05 3035.59 3036.66 3038.76 3040.73 3076.08 3077.94 3081.68 3084.29 3085.22 3090.85 3092.85 3094.43 3097.87 3100.73 3101.60 3108.27 3108.41 3109.04 3109.74 3110.69 3110.82 3112.54 3118.11 3120.21 3120.42 3120.61 3129.93 3131.85 3135.26 3141.01 3871.06
irintensity: 0.00000 0 0 0 0 0 0.17733 2.32848 0.64412 0.11367 0.34482 0.80980 0.57246 0.33760 0.10460 0.03960 0.68234 0.12885 0.10578 0.74995 0.05335 0.33842 0.28305 1.34813 0.18712 0.22460 0.45693 1.96636 1.25732 0.53011 1.69272 1.51702 0.25448 0.42264 0.82005 0.09615 5.74162 4.21938 0.34883 0.09284 0.25720 0.26525 0.97252 0.22806 3.06689 1.39500 1.40521 1.05557 0.72045 0.93498 0.39745 1.05063 0.41551 6.34716 1.80970 0.35481 0.97394 2.14380 4.86901 3.24187 0.30696 2.28349 8.22217 1.93557 5.36950 0.93886 1.31461 24.29482 7.42061 2.38759 1.69618 4.81737 3.88360 2.18754 1.88997 4.47324 0.71812 0.67527 0.72505 0.96335 1.31018 0.88135 2.45300 14.01732 5.22467 4.65941 52.66508 50.41169 24.75387 49.15741 37.65298 89.88192 121.57785 91.41100 17.23935 11.69738 1.46676 14.91376 35.66094 23.90374 2.08727 7.08077 5.84058 6.61720 7.37385 167.03829 663.06901 7.03887 762.44173 734.41148 163.47939 127.21291 38.76383 26.57264 50.79670 21.26122 185.29410 7.82098 95.99247 66.48613 35.56823 114.62955 573.73610 98.08169 186.69718 639.52326 521.34941 82.17905 0.79321 1.66044 1.48037 1.31022 1.70399 2.45914 2.08253 0.39723 0.03651 1.32337 1.16887 0.95149 1.57541 2.70495 1.42293 10.15846 1.62365 3.38604 3.81027 9.28201 0.47698 2.43132 2.92246 1.42469 1.77066 2.16138 543.58588 0.93068 2.97290 0.31243 1.68816 2.61518 0.22170 0.31103 0.31338 1.83518 0.12644 1.56707 1.51432 1.55870 2.62647 4.83649 1.70517 23.22510 0.68151 2.70076 2.60667 11.27890 5.35608 7.52953 5.64130 6.68752 4.33343 3.16457 2.63562 5.63681 3.57276 3.27753 4.48265 1.43276 8.73396 11.01440 0.51355 14.74422 1.31469 5.42051 57.56843 93.23873 10.22131 68.61433 106.35716 50.00202 77.21871 46.40078 108.88851 51.48873 17.61907 47.48762 84.39991 30.54053 19.73984 23.81351 34.64696 37.09047 17.76369 31.89154 13.41797 19.38456 22.60189 13.05713 9.46896 22.95041 2.30447 5.56988 15.02354 19.10623 15.54943 13.09496 11.84602 1.71461 12.10675 7.50678 7.61387 7.50833 4.42253 41.92045
energy: -7516.738811199 hartree
formula: C13H40O19TiV5
InChI: InChI=1/13CH3O.H2O.5O.Ti.5V/c13*1-2;;;;;;;;;;;;/h13*1H3;1H2;;;;;;;;;;;/q;;;;;;;;;;;;-1;;;;;;;+1;;;;;+1/p-1/rC13H40O19TiV5/c1-19-33-20-38(18,24(33)5)30(11)35(15,22(33)3)25(6)34(14,21(33)2)26(7)36(16,23(33)4,31(38)12)29(10)37(17,27(34)8,28(35)9)32(38)13/h18H,1-13H3
78 atoms
V  -1.13436436 -0.26712572 -2.04692675
O  -1.86494134 -0.41241886 -3.42909391
Ti -0.53198708 2.01630867 0.12519418
V  1.99387597 0.41924005 -1.1035614
O  3.33731939 0.70190942 -1.86240549
O  -1.39829984 1.67003658 -1.60772906
O  0.7263651 0.16319881 -2.62177712
O  1.18930969 2.23008491 -0.87576533
O  -0.43400988 -2.15713149 -1.6835402
O  2.03574907 -1.6084145 -0.86550764
O  2.58292561 0.50976455 0.79232383
O  -0.09851737 0.01772306 0.06329249
C  -2.18799826 2.49547475 -2.42581512
H  -2.21875321 3.50646069 -2.01102611
H  -3.20631861 2.10206235 -2.49119755
H  -1.76878998 2.53363439 -3.43501842
C  1.25582345 -0.51567621 -3.73992702
H  2.1024258 0.05073266 -4.13743427
H  0.48621499 -0.61342701 -4.51039724
H  1.61430902 -1.51283386 -3.46443811
C  1.28174282 3.0964725 -1.98485332
H  2.33502716 3.26230993 -2.22488101
H  0.80727965 4.05246976 -1.74701121
H  0.7852425 2.65707272 -2.85441078
C  -0.49709204 -3.20033284 -2.63975247
H  -1.02113199 -4.06041607 -2.21406886
H  0.51026531 -3.51083918 -2.92764638
H  -1.0336543 -2.84524275 -3.52022756
C  3.31101097 -2.13929843 -0.53967996
H  3.28288826 -3.22842778 -0.62822686
H  3.57548823 -1.86217866 0.48335186
H  4.04778808 -1.72436528 -1.22933004
C  3.45219712 1.57709888 1.10773199
H  3.76841987 1.49438085 2.15101057
H  2.95753656 2.54173842 0.9570483
H  4.32769976 1.53204058 0.45422199
V  1.14518199 0.09857445 2.10333033
O  1.93045928 0.17834383 3.46038969
V  0.48376685 -2.37383242 -0.03334243
O  0.85163673 -3.87886867 -0.07727589
V  -1.86146782 -0.56705904 1.10329502
O  -3.37668921 -1.13199652 1.96628576
O  1.3397524 -1.867719 1.61855641
O  -0.69469527 -0.35861027 2.70977574
O  -1.13088313 -2.48895964 0.89710036
O  0.4713568 1.96820313 1.8129879
O  -2.17860028 1.45468029 1.05947588
O  -2.60336562 -0.66255194 -0.76966992
C  1.25019385 -2.7466341 2.72608299
H  1.43664158 -3.7725761 2.39812912
H  1.99678951 -2.45016187 3.46505402
H  0.25754993 -2.67896086 3.17801924
C  -1.2247366 0.34624596 3.80795055
H  -2.11598771 -0.17527855 4.16948063
H  -0.48181386 0.39305857 4.60946731
H  -1.50767224 1.36509604 3.52351839
C  -1.78274946 -3.61751096 1.43612903
H  -2.72593806 -3.78022186 0.90949282
H  -1.14523203 -4.49855282 1.33235506
H  -2.01141587 -3.43537786 2.48766596
C  0.67252385 3.05619255 2.68113869
H  1.21983089 3.85333889 2.16831644
H  -0.29000429 3.45310813 3.01982766
H  1.2482625 2.73341424 3.5508437
C  -3.45207089 1.9639642 0.77024256
H  -3.39592781 3.03867143 0.56978618
H  -3.87851358 1.46036959 -0.10293782
H  -4.11807351 1.81322884 1.62762685
C  -3.44573538 -1.74063065 -1.10325339
H  -3.91479867 -1.55016083 -2.07301999
H  -2.88468217 -2.67928016 -1.17312158
H  -4.21330019 -1.85490008 -0.33334399
O  -0.89680839 3.75175894 0.17223043
C  -1.08897919 5.11258043 0.33877395
H  -1.15093553 5.36341467 1.40312139
H  -0.25853964 5.67542806 -0.10153817
H  -2.01879072 5.43064407 -0.14595356
H  -4.03386092 -0.48104949 2.22480789
converged: yes
empdispcorrection: -0.124990991 hartree
orbitalenergy: -6.3464 -6.1488 -5.9749 -5.9241 -5.6965 -3.3492 -2.4545 -2.4436 -1.8805 -1.8017 electronvolt
orbitalenergy: -7.8557 -7.7594 -7.6408 -7.6122 -7.5748 -3.1140 -2.4137 -2.3947 -1.8832 -1.7843 electronvolt
s2: 8.80509804
charge: 0.000000
dipole: -49.790655 48.766639 -1.024016 1.592076 -0.757863 0.834214 28.954981 -28.730203 0.224778
quadrupole: 4868.174307 -5083.351105 -215.176798 5947.755370 -6136.365852 -188.610482 4959.150589 -5177.111575 -217.960986 -105.206335 98.761398 -6.444937 10.206832 -13.224025 -3.017193 80.081092 -76.625206 3.455886
