program: Gaussian 09
title: 000050495
version: EM64L-G09RevD.01
frameworkgroup: C1[X(C15H20N2O2)]
method: RPBEPBE
basis: SDD
operation: Freq
keyword: #p
keyword: freq=noraman
keyword: PBEPBE/SDD
title: #p freq=noraman PBEPBE/SDD
converged: YES YES NO NO
title: Mulliken charges:
elementType: O O N N C C C C C C C C C C C C C C C H H H H H H H H H H H H H H H H H H H H
charge: -0.237174 -0.241244 -0.248156 -0.645779 -0.370228 -0.364674 0.256058 -0.353188 -0.368357 0.249315 0.078109 0.164263 -0.687226 -0.685077 -0.357164 0.081765 -0.353296 -0.279953 -0.227801 0.198302 0.230253 0.229845 0.189265 0.193772 0.207161 0.211478 0.208920 0.213328 0.210245 0.222746 0.206515 0.212688 0.222945 0.248307 0.261185 0.226591 0.328480 0.334346 0.233431
chargesum: 0.00000
title: Mulliken charges with hydrogens summed into heavy atoms:
elementType: O O N N C C C C C C C C C C C C C C C
charge: -0.237174 -0.241244 -0.248156 0.017048 0.058327 0.054436 0.256058 0.047745 0.052042 0.249315 0.078109 0.164263 -0.040906 -0.042929 -0.108857 0.081765 -0.092111 -0.053362 0.005630
polarizability: 2.25664608e+02 -1.84112229e+01 2.31628249e+02 -4.35045010e+00 2.63658536e+01 1.31048088e+02
1716.lowfreq: -12.8759 -4.0034 -0.7021 -0.0001 0.0004 0.0005 8.5221 35.3248 55.5987
frequency: -4.9915 35.3077 55.5654 69.1527 78.9736 97.9830 102.1996 109.9696 126.5911 180.4953 202.3354 209.7172 223.3507 237.2169 239.3522 283.2897 296.4616 316.9758 319.2047 358.4325 372.0222 425.2938 434.9147 453.8645 462.1272 498.1945 538.0317 568.8648 580.4866 628.0678 640.6966 650.3638 669.5117 716.3924 741.5849 746.8737 750.4424 763.0302 798.2674 856.3254 859.4150 863.4741 880.8175 884.1894 895.3944 939.0787 941.5062 978.1965 1023.5371 1038.5219 1044.4280 1052.7512 1074.4739 1098.0826 1102.5981 1106.1877 1115.4309 1140.3165 1167.6644 1183.3833 1188.8926 1215.0772 1244.2069 1258.0384 1272.9614 1288.5668 1299.0351 1308.0056 1315.0614 1350.2353 1357.8677 1371.4317 1386.2909 1389.2191 1392.5017 1401.3461 1445.9068 1457.8400 1463.8923 1472.9773 1475.1814 1475.3755 1477.0303 1478.5985 1485.8230 1487.7783 1543.0714 1573.0396 1602.8537 1611.7865 1640.2687 2878.6060 2935.7155 2973.4262 2975.5683 2976.9434 2988.9567 3011.3032 3017.6299 3039.5414 3042.7705 3070.8920 3072.3886 3077.7985 3079.8870 3135.4530 3151.4728 3163.9771 3176.7069 3512.7521 3670.4419
redmass: 4.2732 3.4462 3.8090 2.9393 1.7644 2.8068 2.9600 3.0565 3.1992 3.6296 3.3537 1.2990 1.1691 2.6831 3.0494 5.0070 2.8683 5.3519 3.1053 4.3897 5.1600 6.3438 3.1107 6.8365 3.3484 1.3724 3.7237 4.3857 1.1395 6.6369 5.5957 5.4470 6.1969 6.4541 1.7470 1.1671 1.5988 1.4229 3.5593 1.5853 1.3886 1.6108 3.5133 1.5657 1.8043 2.3536 1.5085 1.3072 2.2576 2.9689 2.6128 2.5214 4.8344 1.8891 1.8507 2.1993 2.0505 2.0523 1.1277 3.2656 2.4598 2.0132 1.3049 1.5337 1.4081 1.1606 1.3288 1.3146 1.6311 2.4748 1.4244 1.3780 2.9602 1.2132 1.2240 6.3777 2.6579 1.0876 1.1217 1.2021 1.0536 1.8319 1.1030 1.0546 1.0835 1.0849 1.8620 3.1436 5.4740 9.2927 7.5798 1.0708 1.0632 1.0370 1.0494 1.0453 1.0603 1.0965 1.0931 1.0986 1.1008 1.1016 1.1008 1.0991 1.0994 1.0855 1.0897 1.0950 1.0996 1.0430 1.1052
irintensity: 0.4388 0.6408 0.1102 0.1886 0.1151 1.7267 0.1434 1.5439 0.7316 1.4972 0.7008 0.0238 0.0351 1.9569 0.2537 0.6735 2.3604 1.1429 6.2392 8.6268 10.5974 0.8288 9.6898 1.1258 2.5076 258.4507 0.0965 2.1434 9.5503 1.4864 2.5908 2.0428 2.9825 5.3502 17.3949 7.3563 4.0630 88.1501 11.4887 0.5586 1.7045 4.5586 5.3393 8.3304 5.4627 18.0341 3.8918 0.3704 14.4597 1.1843 5.8802 28.3335 141.6345 16.4029 34.3170 3.2701 2.9553 22.5918 1.5073 29.6152 17.5490 14.6846 12.7275 5.5403 3.3998 2.8706 3.9873 6.2133 15.1818 6.8145 7.7316 7.4111 24.5414 19.9426 16.9032 36.0767 17.2284 1.2719 1.5781 4.3359 3.7857 12.9764 8.5915 11.4624 21.6280 3.4128 163.3188 69.0068 124.0564 317.8051 366.2121 61.5177 35.3672 53.2396 54.4151 11.3091 25.0638 10.1989 2.0614 16.2537 11.5755 63.9132 72.6660 37.1136 53.3729 3.1563 12.4730 18.5769 14.4553 100.0818 69.0364
temp: 298.150 k
press: 1.00000 atm
elementType: 8 8 7 7 6 6 6 6 6 6 6 6 6 6 6 6 6 6 6 1 1 1 1 1 1 1 1 1 1 1 1 1 1 1 1 1 1 1 1
symmnumber: 1
zpe: 848808.9 jmol-1
zpe.correction: 0.323294 hartree
zpe.thermalcorrener: 0.341836 hartree
zpe.thermalcorrenthalpy: 0.342780 hartree
zpe.thermalcorrgfe: 0.276858 hartree
zpe.sumelectzpe: -842.126620 hartree
zpe.sumelectthermal: -842.108078 hartree
zpe.sumelectthermalent: -842.107134 hartree
zpe.sumelectthermalfe: -842.173056 hartree
dipole: -4.4496 -3.4255 -0.9855
dipole: 5.7013
quadrupole: -111.5511 -117.7387 -115.0459
quadrupole: -14.5905 -3.0625 -0.0191
quadrupole: 3.2275 -2.9601 -0.2674 -14.5905 -3.0625 -0.0191
hfenergy: -842.4499142 hartree
pointgroup: C01 [X(C15H20N2O2)]
dipole: 1.6303128 -1.5397545 -0.0500584 debye
polarizability: 228.7369107|19.3789332|234.0367887|4.1051848|10.2508761|125.5672456 unknown
InChI: InChI=1S/C15H20N2O2/c1-3-9-17(10-4-2)14-11-7-5-6-8-12(11)19-15(18)13(14)16/h5-8H,3-4,9-10,16H2,1-2H3
charge 0 multiplicity 1
39 atoms
O  -2.575082 1.539919 0.104914
O  -1.609024 3.621912 0.297336
N  1.356264 -0.197218 0.063861
N  0.95726 2.584268 0.304665
C  1.986215 -0.475817 1.38184
C  1.768005 -1.025998 -1.095773
C  0.023864 0.336737 0.087776
C  3.515476 -0.260784 1.412212
C  2.731274 -0.295973 -2.064984
C  -1.173694 -0.493251 0.027163
C  -0.117771 1.724579 0.208848
C  -2.453988 0.137322 0.020368
C  4.101116 -0.546383 2.811852
C  3.112436 -1.177588 -3.274111
C  -1.159556 -1.920991 0.007229
C  -1.439654 2.381135 0.223937
C  -3.658757 -0.587223 -0.043137
C  -2.354485 -2.658667 -0.051636
C  -3.609512 -1.994795 -0.0875
H  1.76948 -1.520576 1.713464
H  1.512913 0.196167 2.122564
H  0.871291 -1.33058 -1.669901
H  2.247642 -1.962411 -0.73449
H  3.742179 0.781278 1.110036
H  4.002328 -0.919919 0.667164
H  3.641922 0.012096 -1.516627
H  2.238556 0.633298 -2.411543
H  3.663645 0.12684 3.572679
H  3.894159 -1.586994 3.125911
H  5.196387 -0.402925 2.823703
H  3.621693 -2.105143 -2.949455
H  2.215953 -1.471399 -3.852173
H  3.793986 -0.642778 -3.959681
H  -0.19892 -2.442432 0.055387
H  -4.605713 -0.039447 -0.047408
H  -2.317231 -3.753161 -0.064019
H  1.891187 2.19828 0.173452
H  0.780838 3.587411 0.321763
H  -4.538683 -2.571491 -0.137484
