program: TURBOMOLE
programVersion: 7.3
title: Local memory allocated for RDGRAD: 8 MiB
elementType: v
basis: def2-TZVP
elementType: o
elementType: ti
elementType: c
elementType: h
method: uhf
method: dft
functional: pbe0
elementType: v o ti c h
basis: def2-TZVP def2-TZVP def2-TZVP def2-TZVP def2-TZVP
correction: disp3
frequency: 100.00 -0.00 0.0000 0.0000 0.0000 0.0000 0.0000 100.00 100.00 100.00 100.00 100.00 100.00 100.00 100.00 101.07 102.94 110.50 113.84 116.43 116.96 119.39 122.18 124.71 125.15 126.53 129.76 133.99 136.72 140.74 146.05 148.93 154.80 156.48 161.18 163.35 166.93 168.78 170.07 176.29 179.64 181.42 184.22 186.55 190.66 191.53 193.20 194.49 195.08 197.53 198.72 202.43 206.08 208.89 210.68 211.29 214.71 217.03 220.54 221.67 222.63 227.43 229.58 232.41 237.65 238.74 241.93 244.46 247.43 250.45 254.26 262.14 277.30 287.97 300.43 310.77 311.87 315.37 323.08 329.87 335.24 338.21 340.25 347.60 351.91 375.79 377.87 399.58 404.53 411.99 424.07 431.99 433.06 445.67 458.35 461.71 463.30 468.54 474.81 477.59 487.81 488.45 491.96 500.33 504.94 510.91 567.63 575.77 587.92 597.65 610.46 615.09 619.88 1067.81 1069.50 1075.83 1078.43 1082.24 1086.42 1090.17 1096.71 1099.74 1108.78 1110.21 1121.07 1123.47 1130.76 1131.61 1156.76 1166.65 1167.05 1169.39 1169.50 1172.55 1173.21 1173.57 1174.63 1176.12 1176.98 1177.77 1178.71 1181.00 1183.62 1195.32 1195.87 1197.13 1197.24 1199.40 1200.56 1203.37 1206.06 1207.44 1207.63 1208.04 1208.68 1226.20 1456.39 1459.57 1459.86 1461.07 1463.28 1465.24 1465.89 1466.37 1467.82 1468.60 1469.99 1470.58 1472.08 1476.11 1479.01 1479.48 1481.25 1482.72 1484.24 1485.36 1485.67 1485.99 1487.21 1488.53 1488.92 1489.97 1491.16 1491.42 1492.62 1498.97 1499.87 1500.51 1501.89 1502.47 1503.57 1504.83 1507.26 1509.76 1510.78 1631.17 2962.65 2970.32 3005.61 3009.21 3009.81 3012.90 3014.42 3018.68 3021.76 3023.20 3023.60 3024.16 3030.10 3031.34 3034.66 3073.49 3075.26 3078.24 3079.36 3080.54 3087.36 3090.98 3091.48 3093.36 3094.55 3097.65 3103.57 3105.70 3105.87 3108.55 3108.66 3109.29 3109.51 3110.19 3115.03 3116.24 3116.92 3117.62 3119.62 3802.33 3892.82
irintensity: 0.00000 0.00000 0 0 0 0 0 0.39847 1.75533 0.43226 0.59826 0.75935 0.18709 0.30266 4.96102 2.83317 0.74251 1.94100 3.16249 0.32825 0.70288 0.68968 0.17993 2.27284 0.91176 2.05204 0.41035 3.15453 2.09417 2.04727 0.73835 2.75865 0.07363 3.15645 1.08050 0.15433 0.72037 0.36706 0.23663 1.85811 1.36749 2.70954 1.15680 2.84651 1.15561 3.14601 0.87869 1.85155 4.04133 0.48954 1.10296 1.57397 1.82797 1.46896 0.60522 0.40249 0.56214 0.64111 0.68557 0.54889 2.33072 0.36398 1.10833 0.56177 1.16427 5.89264 0.42193 0.60804 2.62500 0.51589 3.60753 5.52791 3.74462 20.64690 0.57113 5.28344 3.11833 0.72903 4.07962 1.58884 1.50544 0.34209 0.49657 1.59743 0.23365 18.41499 21.57374 2.71874 43.35879 0.42358 42.94338 162.67597 82.07055 89.19338 54.66139 43.95365 16.14945 55.85364 65.18747 79.70848 12.07347 18.22080 1.26161 0.92680 53.22995 0.49820 6.53332 69.22143 98.10757 242.40210 771.34082 727.57177 728.69857 41.03044 32.61700 116.74036 17.09304 21.09178 92.34327 23.62982 220.48027 301.64180 39.55835 284.67334 413.84164 169.07748 201.19001 436.36092 264.02918 9.71467 1.09778 9.04276 1.30681 1.17371 3.61192 0.04017 1.17698 0.94855 0.91377 0.14853 0.20249 0.29749 0.00882 1.97763 3.38148 14.82316 4.38949 7.50101 12.04195 3.61328 0.73304 0.51004 0.47781 0.85323 0.86020 550.69525 1.35613 0.54012 0.65247 1.04466 0.37287 0.49403 0.72269 0.59056 0.31209 0.40626 0.64528 0.89078 0.55616 5.04292 2.14313 8.00806 2.31626 1.42119 5.34767 4.36012 4.12261 2.12098 8.31262 9.54087 3.94200 6.44247 5.78271 10.24557 1.06101 9.00017 4.14648 2.17503 3.91412 8.82962 1.23127 20.08251 7.80062 1.24370 3.32338 98.07996 54.81869 141.71680 77.71321 59.31472 13.84583 91.51994 106.93653 9.03589 133.93189 77.70646 46.26434 77.81290 74.82002 71.15194 60.17180 19.41498 48.95375 19.24978 15.40882 36.46812 32.19325 20.57472 25.38056 33.71651 24.31050 7.84108 5.41445 12.86147 1.89321 5.13162 37.05491 9.24182 14.60232 13.94510 11.21975 12.29626 13.23584 11.00148 12.84200 44.16348 99.53437
energy: -7517.356899666 hartree
formula: C13H41O19TiV5
InChI: InChI=1/13CH3O.H2O.5O.Ti.5V/c13*1-2;;;;;;;;;;;;/h13*1H3;1H2;;;;;;;;;;;/q;;;;;;;;;;;;-1;;;;;;;+1;;;;;/rC13H41O19TiV5/c1-19-33-20-38(18,24(33)5)30(11)35(15,22(33)3)25(6)34(14,21(33)2)26(7)36(16,23(33)4,31(38)12)29(10)37(17,27(34)8,28(35)9)32(38)13/h18H2,1-13H3
79 atoms
V  1.92517287 0.0978705 1.36114041
O  3.13903621 0.0374921 2.35851842
Ti -0.15673726 -2.07064715 0.19292093
V  1.4567861 -0.2412787 -1.94611491
O  2.39954772 -0.4999956 -3.17170848
O  1.39289243 -1.87203936 1.36977925
O  2.75384801 -0.14692971 -0.41665375
O  1.05086516 -2.14177198 -1.34587909
O  1.75288051 2.01454214 0.88316306
O  1.31792481 1.73639649 -1.86790277
O  -0.36816467 -0.23041669 -2.76785261
O  -0.02602185 -0.06785841 0.03379184
C  2.16551875 -2.81748929 2.06156335
H  1.74039873 -3.81625147 1.92822151
H  2.19027384 -2.57637941 3.12873495
H  3.19458909 -2.81223645 1.6922263
C  3.91527925 0.62602919 -0.66916896
H  4.38587896 0.27098038 -1.58969332
H  4.61167169 0.51368589 0.16642147
H  3.65868668 1.68185466 -0.78313179
C  2.14214317 -3.0349786 -1.39660152
H  2.48302505 -3.12168003 -2.43090902
H  1.83543174 -4.01825839 -1.02829572
H  2.96676948 -2.65956225 -0.78477951
C  1.98400156 2.95746512 1.90437781
H  1.12132799 3.03608675 2.5751381
H  2.16068794 3.9395284 1.45750654
H  2.85822486 2.66078638 2.49047906
C  1.12385978 2.37437573 -3.12042006
H  1.22337974 3.45498991 -2.9895265
H  0.13248007 2.1486173 -3.51972595
H  1.88336761 2.01878434 -3.82117053
C  -0.5824327 -1.20072271 -3.77106239
H  -1.57427158 -1.06153058 -4.20978661
H  -0.51076035 -2.21332893 -3.3610109
H  0.17882355 -1.08917491 -4.54783641
V  -1.86306304 0.09562998 -1.50080725
O  -3.12644299 0.08577145 -2.43340779
V  0.25594238 2.46576435 -0.37342795
O  0.42029686 4.01715605 -0.52669668
V  -1.21879335 0.41530213 1.5969612
O  -2.49035666 0.81949998 3.31667914
O  -1.35994722 2.01822202 -1.45414645
O  -2.72126452 0.37853327 0.33705299
O  -0.96188387 2.32054962 1.25438913
O  -1.71399797 -1.85902676 -0.97751032
O  -1.36100095 -1.55457289 1.76073239
O  0.39088914 0.36070114 2.70205764
C  -2.44637982 2.91779444 -1.42548574
H  -2.07507701 3.94538324 -1.38399971
H  -3.04620461 2.78550462 -2.33019561
H  -3.08956067 2.732152 -0.55899736
C  -3.91652623 -0.30809947 0.60750711
H  -4.36476964 0.04782648 1.54305637
H  -4.62760497 -0.14450123 -0.20655348
H  -3.73059046 -1.38178268 0.71134316
C  -1.64930592 3.39597714 1.82064844
H  -1.43627444 3.47868863 2.8958375
H  -1.34392646 4.33301672 1.34902463
H  -2.73561086 3.29396373 1.6801314
C  -2.55429711 -2.89107976 -1.427818
H  -1.97835301 -3.63657615 -1.98591193
H  -3.03416325 -3.38804267 -0.57763866
H  -3.32609419 -2.47967066 -2.08159873
C  -1.31862822 -2.23308621 2.98352206
H  -1.50862946 -3.29925864 2.82795088
H  -0.33453965 -2.12200768 3.45237174
H  -2.08412732 -1.84134399 3.66230554
C  0.54668431 0.64693467 4.05767603
H  1.59253997 0.5310741 4.35348973
H  0.25533411 1.68353143 4.28640447
H  -0.05194731 -0.03664421 4.67832121
O  -0.33559714 -3.82524908 0.4269731
C  -0.54223095 -5.18768356 0.55289524
H  -1.2454439 -5.54146355 -0.20878944
H  0.40101275 -5.73199277 0.4302319
H  -0.95273766 -5.42827898 1.54020354
H  -1.98969241 1.06521991 4.1027944
H  -3.12203924 1.53029129 3.16253718
converged: yes
empdispcorrection: -0.125786671 hartree
orbitalenergy: -6.5645 -6.1432 -5.9738 -5.9290 -5.4488 -1.9970 -1.7570 -1.6346 -1.4617 -0.8828 electronvolt
orbitalenergy: -7.6429 -7.5997 -7.4784 -7.4244 -7.3293 -1.7807 -1.6472 -1.4999 -0.8699 -0.8118 electronvolt
s2: 12.06377508
charge: 0.000000
dipole: -10.419125 8.186403 -2.232722 -17.831380 16.494474 -1.336906 17.091744 -13.688712 3.403031
quadrupole: 4927.599742 -5143.339954 -215.740211 5906.554648 -6106.025226 -199.470578 5155.606327 -5358.825140 -203.218813 5.981275 -11.070550 -5.089275 -28.452157 15.931547 -12.520611 22.385166 -14.767838 7.617328
