program: TURBOMOLE
programVersion: 7.3
title: Local memory allocated for RDGRAD: 8 MiB
elementType: v
basis: def2-TZVP
elementType: o
elementType: c
elementType: h
method: uhf
method: dft
functional: pbe0
elementType: v o c h
basis: def2-TZVP def2-TZVP def2-TZVP def2-TZVP
correction: disp3
frequency: 100.00 -0.00 0.0000 0.0000 0.0000 0.0000 0.0000 100.00 100.00 100.00 100.00 100.00 100.00 102.58 108.84 111.79 115.16 116.56 116.89 118.90 121.42 124.25 126.11 130.60 132.65 137.56 138.01 145.43 153.02 162.90 165.67 171.76 172.62 174.40 174.81 176.36 178.96 182.81 184.51 187.55 189.56 190.69 192.13 195.07 199.33 201.39 203.22 204.97 207.89 209.25 211.78 214.27 216.40 218.90 221.33 223.38 223.56 229.93 230.48 233.37 235.16 240.69 243.07 247.38 248.96 252.95 256.41 262.45 265.66 283.16 293.22 301.73 308.57 312.87 315.05 315.99 327.94 337.15 346.11 348.36 357.63 365.31 378.65 395.23 401.29 407.51 409.34 411.96 421.36 434.35 445.04 449.89 463.92 469.15 474.11 476.83 479.14 489.78 493.80 498.32 501.43 507.12 516.99 568.69 591.88 597.72 609.16 613.78 618.40 1069.48 1070.65 1071.59 1075.61 1080.20 1084.71 1087.37 1092.60 1096.32 1097.86 1101.64 1104.32 1109.93 1114.19 1126.28 1133.46 1155.35 1165.80 1167.97 1168.08 1169.27 1171.28 1172.57 1175.80 1176.37 1178.49 1179.66 1180.47 1182.88 1196.82 1199.74 1200.88 1201.21 1201.41 1203.58 1203.86 1204.06 1204.46 1204.54 1204.69 1205.41 1457.22 1458.40 1459.15 1459.85 1461.05 1462.28 1463.53 1465.00 1466.12 1467.62 1469.38 1471.81 1473.73 1475.88 1478.87 1479.96 1481.24 1482.24 1483.67 1484.61 1485.28 1486.83 1487.50 1487.68 1489.79 1490.30 1493.70 1495.72 1496.93 1498.46 1502.80 1504.92 1506.13 1509.56 1511.19 1512.49 1622.29 2975.45 2982.66 3003.35 3018.36 3019.15 3020.06 3020.79 3022.18 3032.63 3033.68 3036.17 3038.34 3038.50 3063.32 3077.05 3085.85 3087.08 3089.83 3092.86 3093.21 3095.21 3102.87 3104.29 3104.92 3105.42 3107.46 3108.08 3108.80 3109.93 3111.79 3112.64 3118.49 3122.05 3125.82 3129.63 3139.70 3811.03 3905.96
irintensity: 0.00000 0.00000 0 0 0 0 0 0.84332 2.01252 0.58942 3.90838 10.32531 2.59868 0.83392 2.43545 4.51686 0.13203 0.93070 0.99760 0.50896 0.64241 2.17477 0.50084 0.20065 0.49877 1.71256 0.43357 2.48236 4.09825 0.18888 0.97213 0.30798 0.60669 1.81635 1.09984 0.25567 0.75537 11.02167 4.83001 0.16901 0.45043 0.89738 1.33867 0.89377 0.28035 0.23220 0.62397 1.66917 1.86666 1.46000 0.05210 1.46098 0.32090 0.17815 0.26021 0.31625 1.08458 0.49937 0.19678 0.02544 1.20381 1.58994 2.09591 0.18661 5.46185 4.73414 0.41952 1.35686 4.33396 8.73114 0.72426 2.02037 1.48847 0.08885 0.29833 5.36002 1.77447 1.49224 13.79222 1.42143 5.17528 136.57031 9.47596 3.13604 28.08296 73.21559 36.25021 12.49513 49.99826 77.80448 175.03599 108.77234 36.68248 8.93774 20.29415 0.66675 18.30440 11.89020 8.64386 18.50634 7.00855 3.36051 0.72580 2.50446 204.33714 130.29106 711.47297 348.97395 656.84407 22.93115 56.63592 134.04940 10.42593 39.11967 60.99289 22.21859 59.72560 61.86281 268.31428 197.76496 427.76400 440.55841 156.71530 585.17052 406.32430 95.01706 0.40415 3.63481 1.15181 14.23650 4.85405 0.46891 2.43767 4.27360 0.53178 1.30248 0.50560 0.74551 21.07421 0.67535 9.34842 5.90495 14.45840 2.26919 3.08461 0.98441 3.91687 0.92347 0.76516 0.57261 3.14399 4.44343 2.44248 1.53885 1.04084 0.71190 0.30729 0.07469 0.26164 0.73120 1.79781 0.51784 6.00090 4.80377 1.15283 9.42733 7.36503 7.70063 2.56798 1.18629 3.14051 16.30545 5.56294 3.98437 6.06722 3.72273 2.71821 8.66002 5.49349 2.40048 5.39249 1.71742 9.76999 6.33447 12.08583 1.06470 116.49071 62.28656 100.20553 154.73179 79.67382 55.88222 81.87681 58.92691 75.48012 9.47777 35.44930 61.50228 65.18027 83.16435 30.18847 24.59835 26.87948 29.17788 32.22928 13.16662 31.08207 30.46334 7.60523 9.20072 11.72192 13.21232 12.85516 8.44645 19.78997 7.04080 15.09266 15.44592 13.55536 6.65086 11.04951 7.66491 5.20016 37.16599 112.07466
energy: -7571.944599243 hartree
formula: C12H38O19V6
InChI: InChI=1/12CH3O.H2O.6O.6V/c12*1-2;;;;;;;;;;;;;/h12*1H3;1H2;;;;;;;;;;;;/rC12H38O19V6/c1-20-32(13)21(2)34(15)24(5)33(20,14)25(6)35(16,22(32)3)27(8)36(17,23(32)4,26(34)7)31(12)37(18,19,28(33)9,29(34)10)30(35)11/h18H2,1-12H3
75 atoms
V  0.74965495 -2.11092836 -0.72045955
O  1.25744471 -3.50483613 -1.24176046
V  -0.60659322 0.5712069 -2.11857788
O  -1.00137421 0.98550032 -3.58393875
O  -1.16630699 -2.5013909 -0.26731896
O  0.06618177 -1.29460652 -2.41597653
O  -2.31957063 -0.23415335 -1.4322489
O  2.41500456 -0.95264115 -0.89091999
O  1.33143927 1.17904124 -2.04578797
O  -1.05657032 2.24461444 -1.11934334
O  0.02829724 -0.02742302 0.03932523
C  -1.76336314 -3.65799169 -0.77257207
H  -2.8533905 -3.64408833 -0.62876333
H  -1.36541433 -4.54292676 -0.26673775
H  -1.57601011 -3.76129964 -1.84525568
C  0.80362299 -1.4945101 -3.60099468
H  0.17100515 -1.26813994 -4.46415263
H  1.14137007 -2.53333323 -3.65393978
H  1.6775667 -0.83556682 -3.64030343
C  -3.03919751 -0.99848354 -2.36287672
H  -3.42550968 -0.34726193 -3.15220987
H  -3.88724219 -1.50250247 -1.88158687
H  -2.40074443 -1.75786883 -2.82311658
C  3.60525679 -1.35928016 -1.53553214
H  4.46520082 -1.11865266 -0.90567053
H  3.71077683 -0.83727137 -2.49041096
H  3.56551487 -2.43483105 -1.71218666
C  1.63189173 2.34488085 -2.78431685
H  2.68457271 2.60744033 -2.65151717
H  1.00258254 3.17429502 -2.45155813
H  1.42466044 2.15249245 -3.83927233
C  -2.21791099 2.92027336 -1.54065938
H  -2.38528299 3.79713656 -0.90859614
H  -3.09667966 2.26876301 -1.4875995
H  -2.09592739 3.23628678 -2.58092431
V  -0.68181602 2.07068533 0.836566
O  -1.10321739 3.49230253 1.35783731
V  2.10696816 0.82497243 -0.31823895
O  3.50588826 1.45292635 -0.57703588
V  0.67839678 -0.62618433 2.24739381
O  1.14599375 -1.0039744 3.69914225
O  1.26570575 2.39486856 0.35620788
O  -0.05629403 1.20992703 2.52305458
O  2.34623315 0.27435165 1.49932729
O  -2.35327938 0.98691812 1.038347
O  -1.20150026 -1.2944587 2.18449983
O  1.19897622 -2.25481388 1.21781282
C  1.74764541 3.7207777 0.32288292
H  2.7988721 3.72607046 0.02605128
H  1.16265404 4.31181465 -0.38570193
H  1.63926653 4.16728724 1.31391971
C  -0.86735421 1.38517422 3.66464124
H  -0.32153346 1.0487124 4.55040151
H  -1.1235656 2.44313392 3.77020107
H  -1.78960435 0.80111159 3.58080653
C  3.03892523 1.11518705 2.40107369
H  3.258703 0.54851711 3.30771845
H  3.96640378 1.46358282 1.93903835
H  2.41230235 1.97318644 2.6598465
C  -3.64944676 1.48241338 1.19621992
H  -4.24296124 1.33710523 0.281283
H  -4.14897468 0.98380443 2.03675329
H  -3.62355345 2.55461019 1.4047915
C  -1.46224144 -2.55696176 2.74749455
H  -2.53354314 -2.77751422 2.69200779
H  -0.90224832 -3.33280839 2.21688546
H  -1.15703234 -2.55587838 3.79705452
C  2.45008168 -2.81874677 1.54572049
H  2.58835237 -3.74880212 0.98738237
H  3.26769655 -2.1323149 1.30042748
H  2.48381582 -3.0246689 2.61900037
O  -3.82548631 -1.54603359 0.80267377
V  -1.83522779 -0.78677149 0.40544143
H  -4.54089746 -0.95255172 0.55125354
H  -4.04059128 -2.41680901 0.4537222
converged: yes
empdispcorrection: -0.121656747 hartree
orbitalenergy: -6.5320 -6.2255 -6.0446 -5.9666 -5.7707 -3.2413 -2.4183 -2.3175 -1.9078 -1.0715 electronvolt
orbitalenergy: -7.7909 -7.6330 -7.6145 -7.5036 -7.4827 -3.0631 -2.3809 -2.2723 -0.8419 -0.8169 electronvolt
s2: 12.06762951
charge: 0.000000
dipole: 12.964274 -14.886455 -1.922181 -13.031263 12.405958 -0.625306 19.266855 -19.568784 -0.301930
quadrupole: 5094.363549 -5271.905749 -177.542201 4962.398903 -5170.669867 -208.270965 4821.299041 -5040.726056 -219.427015 59.562783 -45.003807 14.558976 -33.417555 28.356969 -5.060586 22.413975 -22.500676 -0.086700
