program: TURBOMOLE
programVersion: 7.3
title: Local memory allocated for RDGRAD: 8 MiB
elementType: v
basis: def2-TZVP
elementType: o
elementType: c
elementType: h
method: uhf
method: dft
functional: pbe0
elementType: v o c h
basis: def2-TZVP def2-TZVP def2-TZVP def2-TZVP
correction: disp3
frequency: -0.00 -0.00 0.0000 0.0000 0.0000 0.0000 100.00 100.00 100.00 100.00 100.00 102.18 107.32 109.40 113.16 116.81 118.63 122.07 122.94 124.77 127.16 129.19 130.61 132.25 137.54 138.15 142.30 148.26 152.71 161.25 164.39 168.39 169.07 169.68 173.11 178.45 182.36 184.20 187.42 188.17 190.41 193.03 194.85 195.97 197.37 198.83 202.24 203.11 206.37 210.40 211.18 212.54 215.88 216.91 217.89 218.90 224.11 227.60 229.65 233.85 238.22 240.21 240.99 243.46 250.23 251.37 255.91 258.28 259.10 283.17 296.28 302.12 304.69 308.03 310.06 318.62 319.74 328.30 334.87 338.10 346.66 351.96 378.01 381.16 393.17 397.66 401.75 410.58 427.12 432.08 443.32 456.47 467.57 470.56 475.60 479.19 484.87 489.76 494.12 495.94 501.68 507.14 541.39 579.44 586.79 593.59 601.98 613.81 617.73 1050.09 1051.49 1054.95 1058.49 1065.63 1097.91 1102.56 1109.01 1110.52 1113.76 1116.19 1121.06 1123.85 1125.59 1138.69 1149.16 1166.54 1170.90 1172.11 1177.35 1178.06 1178.67 1180.47 1182.01 1182.79 1183.50 1184.19 1184.26 1188.88 1200.92 1202.53 1202.57 1202.67 1204.25 1205.21 1205.46 1206.11 1206.25 1206.55 1206.99 1208.72 1448.05 1456.63 1459.18 1459.82 1460.68 1461.16 1462.03 1462.70 1464.70 1468.15 1469.40 1470.02 1472.43 1473.18 1473.58 1477.95 1479.10 1480.12 1481.76 1482.36 1485.75 1486.00 1487.15 1487.71 1489.04 1491.33 1492.19 1499.19 1501.53 1503.06 1504.14 1505.14 1508.35 1510.46 1513.85 1515.14 1624.45 2897.41 2924.83 2976.30 2992.20 3002.80 3003.15 3003.40 3003.53 3004.17 3007.56 3008.89 3011.76 3014.11 3046.50 3051.38 3063.50 3064.57 3064.79 3066.68 3072.22 3072.73 3072.96 3076.60 3079.79 3081.33 3082.12 3083.10 3084.32 3086.25 3087.04 3087.12 3088.70 3090.52 3091.38 3092.75 3093.08 3770.45 3858.94
irintensity: 0.00000 0.00000 0 0 0 0 2.96748 0.51992 0.88163 0.49955 14.14340 0.81766 2.28876 1.47393 0.70566 3.25759 0.62527 0.78644 2.32476 0.27328 0.08484 0.35615 1.88178 0.35750 1.12431 2.74401 0.20096 2.43563 2.53342 0.71590 1.46030 2.64071 0.54124 2.26552 0.53344 0.50302 0.59740 0.36194 2.47151 0.96188 6.91468 2.55792 1.51855 5.16572 1.51460 1.42384 0.85279 2.27142 1.49391 0.22616 2.80849 0.96150 0.28017 1.20718 2.33153 0.50141 0.88805 0.21583 1.72279 2.74823 1.69089 2.40044 1.17347 0.78744 4.07007 1.95733 0.39524 2.85408 1.54315 1.73000 5.32403 4.37178 0.95683 0.73540 4.33530 3.96492 0.82521 0.28066 0.26849 1.97963 1.93809 0.16459 7.68104 45.24734 37.87507 25.70972 80.43966 6.41167 77.44394 110.45345 181.64351 26.81473 22.57056 9.26232 35.44041 19.16258 0.49575 0.20080 1.84402 12.34648 12.37817 1.11923 355.98902 263.73810 118.34899 47.08641 598.60345 561.25805 475.13302 163.70242 270.22480 95.46137 101.30427 23.74978 71.87435 187.82495 14.58162 48.07934 68.33454 79.64107 345.91445 95.45034 346.71354 558.49388 359.50491 14.04779 52.48702 103.79683 1.73467 3.66388 1.42773 3.49092 1.94127 2.58675 4.06527 0.29332 0.14907 0.02348 18.54200 0.51836 12.37334 2.51711 0.20412 7.86856 2.61278 0.38880 0.98803 2.18909 1.53324 12.45787 2.40252 0.83283 0.12451 0.09697 0.09335 0.42028 0.11688 0.64940 0.06921 1.00264 2.10911 1.52524 0.31411 3.57377 4.19353 2.36028 4.22395 6.53484 2.92519 5.90229 2.66652 2.41239 4.51221 4.83123 6.34894 4.44044 2.78647 6.49288 4.34301 2.94724 3.10015 2.24914 5.79389 3.11419 7.43265 5.14053 59.17549 179.32035 173.10938 44.85398 87.70334 25.33658 23.22661 105.41324 58.04572 216.66852 115.15566 179.17519 84.54255 104.95008 29.08143 57.44228 43.63368 17.21199 100.96331 38.71039 16.11876 14.24513 10.88649 36.66510 3.24341 19.91879 35.01585 18.39977 4.37650 19.23238 5.41053 21.62415 46.87606 12.53702 42.10098 16.81308 20.40080 37.94663 135.61985
energy: -7572.057675777 hartree
formula: C12H38O19V6
InChI: InChI=1S/12CH3O.H2O.6O.6V/c12*1-2;;;;;;;;;;;;;/h12*1H3;1H2;;;;;;;;;;;;
75 atoms
V  0.94783799 -2.12870655 0.34851892
O  1.52185599 -3.5896605 0.5308264
V  0.94096162 0.093113 -2.10537738
O  1.55547343 0.14202186 -3.56234474
O  -0.85777293 -2.59830161 -0.47810795
O  1.54418569 -1.72530791 -1.52538584
O  -0.86025827 -0.7724061 -2.55836142
O  2.3670291 -0.96440685 1.08587335
O  2.42086077 0.84810996 -1.00553704
O  0.01065846 1.87656173 -2.02898595
O  -0.05240509 -0.0309883 -0.01275159
C  -1.3293863 -3.90892745 -0.50902853
H  -2.40356948 -3.93378606 -0.73362162
H  -1.1694906 -4.40045298 0.45576653
H  -0.79596437 -4.49071589 -1.27112503
C  2.797896 -2.13950328 -1.99596856
H  2.75216683 -2.27576726 -3.08290686
H  3.0800575 -3.08496042 -1.52129313
H  3.57111552 -1.39319793 -1.78586045
C  -0.77625575 -1.85863052 -3.4267461
H  -0.24921797 -1.56785959 -4.34135115
H  -1.77978298 -2.21100339 -3.73500261
H  -0.24436913 -2.69679149 -2.96483473
C  3.72789605 -1.29794716 1.07192175
H  4.20679457 -0.90572198 1.97599124
H  4.23882183 -0.8611691 0.20699979
H  3.84597876 -2.38585108 1.04099586
C  3.21078158 1.83263269 -1.61889354
H  3.89980301 2.26538116 -0.88653614
H  2.59670809 2.63278528 -2.04491547
H  3.78480077 1.38023067 -2.43595811
C  -0.68321447 2.25494901 -3.18894573
H  -1.09244315 3.26292362 -3.06024508
H  -1.50841186 1.56453134 -3.40060946
H  0.0007958 2.2407576 -4.0442736
V  -0.9474635 2.12393058 -0.28178
O  -1.62310909 3.53825952 -0.48894627
V  1.90142471 0.98242128 0.93599796
O  3.1959202 1.62891881 1.56262687
V  -0.96837268 -0.10552472 2.18755792
O  -1.63861992 -0.20642661 3.61437354
O  0.79507936 2.60109673 0.52819983
O  -1.62218269 1.67622557 1.5521913
O  0.76650608 0.7707033 2.57370135
O  -2.41529303 0.93043181 -1.03678428
O  -2.45112574 -0.92227899 1.04891317
O  -0.00902248 -1.86554991 2.09080603
C  1.34072336 3.85068485 0.20526093
H  2.35515086 3.92837832 0.60845185
H  1.37621373 4.00462446 -0.87879399
H  0.71754968 4.64251501 0.63666718
C  -2.94611672 1.99777145 1.87968659
H  -3.06283788 1.9954515 2.96891726
H  -3.19400721 2.98980229 1.4872125
H  -3.64981201 1.26526082 1.46606943
C  0.72169487 1.87458503 3.44653359
H  0.21127552 1.58306439 4.37057949
H  1.74360491 2.19401299 3.67521104
H  0.18134688 2.710928 2.99307525
C  -3.69815225 1.32694478 -1.3750954
H  -3.92250726 1.08888084 -2.43064112
H  -4.45444331 0.84823858 -0.7315543
H  -3.81003124 2.40955351 -1.26223406
C  -3.11051431 -2.0326638 1.59173554
H  -3.79120242 -2.47525009 0.85408239
H  -2.38867519 -2.79286702 1.90710693
H  -3.68624063 -1.72129606 2.46960203
C  0.71180068 -2.21932586 3.24824289
H  1.1243718 -3.2265254 3.12571113
H  1.53359172 -1.51889273 3.42467649
H  0.03962961 -2.19841276 4.11261228
O  -3.50519599 -1.74796662 -1.69746349
V  -1.70560653 -0.87980005 -0.75642434
H  -4.07278611 -1.00493267 -1.93447158
H  -3.18962727 -2.1179356 -2.53148866
converged: yes
empdispcorrection: -0.121256103 hartree
orbitalenergy: -3.2170 -3.0580 -2.9901 -2.9356 -2.4605 1.1174 1.7898 1.9407 2.0457 2.0662 electronvolt
orbitalenergy: -4.6520 -4.5479 -4.5104 -4.3237 -4.2641 1.8217 2.1973 2.3399 2.4924 2.6440 electronvolt
s2: 15.82694925
charge: -1.000000
dipole: -19.615513 17.228493 -2.387021 -14.164244 13.154735 -1.009509 -4.209709 2.392970 -1.816739
quadrupole: 5174.908635 -5392.138440 -217.229805 4998.591283 -5233.011423 -234.420140 4822.794331 -5057.613063 -234.818732 41.096600 -33.354064 7.742536 0.577977 11.308918 11.886895 29.532748 -24.118972 5.413776
