program: Orca
programVersion: 5.0.4
elementType: Pt N H H H N H H H Cl N C C C C C H H H H C C C C C C F F F F F N C H H C H N C H H C O N C H N C O N C H H C H N C H H C O N C H N C O N C H H C H N C H H C O N C H N C O N C H H C H N C H H C O N C H N C O N C H H C H N C H H C O N C H N C O N C H H C H N C H H C O N C H N C O N C H H C H N C H H C O N C H N C O
elementType: Pt
keywords: B3LYP D3BJ def2-TZVPP def2/J RIJCOSX TightSCF CPCM(water) NMR
formula: C53H52ClF5N31O14Pt
InChI: InChI=1/C42H42N28O14.C11H4F5N.ClH.2H3N.Pt/c71-29-43-1-44-16-18-48(30(44)72)4-52-20-22-56(34(52)76)8-60-24-26-64(38(60)80)12-68-28-27-67(41(68)83)11-63-25-23-59(37(63)79)7-55-21-19-51(33(55)75)3-47(29)17-15(43)45-2-46(16)32(74)50(18)6-54(20)36(78)58(22)10-62(24)40(82)66(26)14-70(28)42(84)69(27)13-65(25)39(81)61(23)9-57(21)35(77)53(19)5-49(17)31(45)73;12-7-6(5-1-3-17-4-2-5)8(13)10(15)11(16)9(7)14;;;;/h15-28H,1-14H2;1-4H;1H;2*1H3;/q;-1;;;;+2/p-1/rC42H42N28O14.C11H10ClF5N3Pt/c71-29-43-1-44-16-18-48(30(44)72)4-52-20-22-56(34(52)76)8-60-24-26-64(38(60)80)12-68-28-27-67(41(68)83)11-63-25-23-59(37(63)79)7-55-21-19-51(33(55)75)3-47(29)17-15(43)45-2-46(16)32(74)50(18)6-54(20)36(78)58(22)10-62(24)40(82)66(26)14-70(28)42(84)69(27)13-65(25)39(81)61(23)9-57(21)35(77)53(19)5-49(17)31(45)73;12-21(18,19)20-3-1-5(2-4-20)6-7(13)9(15)11(17)10(16)8(6)14/h15-28H,1-14H2;1-4H,18-19H3
157 atoms
Pt 0.003011 -0.015637 4.886378
N  -0.32712 2.056533 4.936059
H  -1.209658 2.28191 5.386971
H  -0.363007 2.458126 4.004373
H  0.407146 2.54583 5.439955
N  0.022019 -0.113125 6.961195
H  -0.842337 0.214878 7.38352
H  0.785407 0.41664 7.372705
H  0.144059 -1.085271 7.233718
Cl 0.351214 -2.325282 4.872921
N  -0.000598 0.025026 2.83987
C  1.115855 0.323542 2.154863
C  1.154483 0.326638 0.774486
C  0.003633 0.013329 0.049123
C  -1.148112 -0.294918 0.773738
C  -1.115223 -0.281256 2.153509
H  1.989949 0.564107 2.739936
H  2.078268 0.583249 0.280367
H  -2.06986 -0.557929 0.278759
H  -1.988827 -0.522487 2.737782
C  0.005101 0.005225 -1.431748
C  1.010948 -0.628285 -2.163203
C  1.017377 -0.648933 -3.547783
C  0.00301 -0.015636 -4.248374
C  -1.010603 0.629011 -3.555702
C  -1.001367 0.628775 -2.170341
F  1.999642 -1.272616 -1.530545
F  1.989041 -1.279678 -4.210213
F  0.001265 -0.025191 -5.57852
F  -1.983067 1.250432 -4.224388
F  -1.988266 1.282482 -1.545852
N  -4.18671 -3.20768 -1.23007
C  -3.5811 -4.40734 -1.76409
H  -3.45055 -4.26415 -2.83301
H  -4.25958 -5.24588 -1.58986
C  -4.96095 -3.18066 -0.00552
H  -5.68086 -4.00164 0.0042
N  -4.18983 -3.17828 1.22282
C  -3.59637 -4.37035 1.7887
H  -3.47495 -4.20355 2.85527
H  -4.27836 -5.20869 1.62795
C  -4.35261 -2.01554 1.94309
O  -3.89301 -1.78852 3.05157
N  -5.15067 -1.16692 1.20923
C  -5.61561 -1.76955 -0.0233
H  -6.70709 -1.78988 -0.04508
N  -5.10186 -1.17565 -1.24297
C  -4.31587 -2.04865 -1.96122
O  -3.84012 -1.84092 -3.06677
N  -0.11692 -5.23808 -1.19117
C  1.19039 -5.51751 -1.74385
H  1.14539 -5.32137 -2.81138
H  1.41986 -6.57259 -1.57703
C  -0.60663 -5.83063 0.03794
H  -0.39895 -6.90267 0.04846
N  -0.12805 -5.21624 1.26064
C  1.17986 -5.4767 1.82039
H  1.13252 -5.25998 2.88371
H  1.41617 -6.53366 1.6756
C  -1.13742 -4.61292 1.97693
O  -1.02575 -4.09796 3.07885
N  -2.30101 -4.72044 1.24871
C  -2.12315 -5.48309 0.02859
H  -2.77742 -6.35729 0.03105
N  -2.28907 -4.73774 -1.2038
C  -1.11977 -4.64451 -1.92454
O  -0.99833 -4.14732 -3.03343
N  4.02915 -3.35738 -1.20607
C  5.06268 -2.51159 -1.76103
H  4.8796 -2.42545 -2.8283
H  6.03095 -2.99035 -1.59504
C  4.18201 -4.09671 0.0316
H  5.1426 -4.61606 0.04501
N  4.01581 -3.32204 1.24604
C  5.05565 -2.48303 1.80121
H  4.86587 -2.38165 2.86602
H  6.01863 -2.97724 1.64984
C  2.90784 -3.70733 1.96753
O  2.57891 -3.2758 3.06155
N  2.25139 -4.68561 1.25497
C  2.95109 -5.0481 0.0381
H  3.21197 -6.10831 0.05442
N  2.26554 -4.72007 -1.19656
C  2.93109 -3.7638 -1.93042
O  2.61832 -3.36669 -3.04229
N  5.14485 1.05511 -1.22766
C  5.11669 2.3888 -1.78719
H  4.92577 2.29587 -2.85257
H  6.09448 2.85085 -1.63163
C  5.84801 0.71708 -0.00552
H  6.85462 1.13993 -0.02098
N  5.17305 1.0763 1.22631
C  5.15865 2.4183 1.7660
H  4.99058 2.34154 2.83652
H  6.13244 2.87768 1.58116
C  4.80235 -0.02554 1.96355
O  4.30156 -0.00793 3.07743
N  5.12531 -1.15175 1.24085
C  5.82015 -0.83867 0.00727
H  6.8108 -1.29801 0.00625
N  5.11229 -1.17378 -1.21255
C  4.76525 -0.05863 -1.94227
O  4.23847 -0.0584 -3.04417
N  2.38512 4.67962 -1.23659
C  1.32722 5.49931 -1.78507
H  1.28103 5.30971 -2.85368
H  1.57791 6.54857 -1.61233
C  3.08298 4.99962 -0.00815
H  3.36667 6.05406 0.00033
N  2.38228 4.65905 1.21572
C  1.32054 5.46857 1.7735
H  1.27199 5.26033 2.83853
H  1.56828 6.52165 1.61896
C  3.03838 3.69219 1.94469
O  2.71914 3.28982 3.05276
N  4.13446 3.28132 1.21995
C  4.29328 4.02271 -0.01441
H  5.26375 4.52285 -0.03113
N  4.10278 3.25904 -1.23262
C  3.01558 3.6915 -1.95915
O  2.68432 3.28871 -3.06368
N  -2.16228 4.76009 -1.24268
C  -3.45821 4.44472 -1.80313
H  -3.32552 4.28508 -2.86945
H  -4.12311 5.29681 -1.64339
C  -1.98613 5.50568 -0.01137
H  -2.63309 6.38575 -0.00824
N  -2.16896 4.7472 1.2101
C  -3.47011 4.43216 1.75716
H  -3.35071 4.26639 2.82412
H  -4.13081 5.28666 1.59162
C  -1.00464 4.62822 1.93588
O  -0.89512 4.11393 3.03832
N  0.00958 5.21874 1.21556
C  -0.46669 5.83907 -0.00552
H  -0.24854 6.90896 0.00565
N  0.0133 5.24382 -1.23694
C  -0.9964 4.66003 -1.96815
O  -0.88321 4.16555 -3.07915
N  -5.0667 1.26149 -1.25557
C  -5.62399 0.04795 -1.81081
H  -5.4028 0.03787 -2.87433
H  -6.70693 0.06467 -1.66577
C  -5.56242 1.87907 -0.04035
H  -6.65292 1.9305 -0.06161
N  -5.11427 1.27118 1.19645
C  -5.6900 0.06334 1.74554
H  -5.50503 0.06642 2.81601
H  -6.76695 0.07784 1.56242
C  -4.29279 2.10213 1.92432
O  -3.84116 1.87005 3.03508
N  -4.09573 3.25403 1.19648
C  -4.86513 3.2695 -0.0331
H  -5.55986 4.11181 -0.03289
N  -4.08671 3.26311 -1.25555
C  -4.2442 2.09968 -1.97471
O  -3.76186 1.86397 -3.07191
elementType: Pt N H Cl C F O
totalener: -5879.80040610 hartree
cpcmener: -0.31283406 hartree
kineticenergy: 5778.52637326 hartree
exchangeener: -560.108353898184 hartree
correlationener: -32.563921590744 hartree
xcener: -592.672275488928 hartree
chargesum: 1.0000000
charge: 0.215201 -0.288063 0.201721 0.229423 0.200561 -0.139106 0.205056 0.205228 0.182701 -0.492365 -0.105885 -0.010110 -0.155556 0.144407 -0.159349 -0.006029 0.180219 0.173127 0.177735 0.189735 -0.034701 0.225437 0.165746 0.205621 0.151444 0.216892 -0.231127 -0.179235 -0.187010 -0.174824 -0.227232 -0.103036 -0.067074 0.108317 0.153568 0.040519 0.136306 -0.093556 -0.063753 0.107291 0.153905 0.275063 -0.468490 -0.096127 0.064564 0.141957 -0.107808 0.302243 -0.469006 -0.101784 -0.067012 0.105183 0.150811 0.053634 0.131123 -0.105634 -0.056397 0.105987 0.151455 0.284019 -0.442097 -0.104633 0.054658 0.132641 -0.105168 0.299239 -0.473573 -0.091598 -0.060433 0.102125 0.153930 0.059611 0.130510 -0.106970 -0.067350 0.107092 0.154370 0.285771 -0.446842 -0.104624 0.042090 0.131434 -0.087478 0.264181 -0.452328 -0.098886 -0.075131 0.108680 0.155075 0.061834 0.141637 -0.097190 -0.067679 0.111733 0.155961 0.279737 -0.468799 -0.088798 0.027163 0.134242 -0.093303 0.288877 -0.458921 -0.100089 -0.068409 0.108492 0.153623 0.043486 0.135119 -0.095822 -0.076571 0.112787 0.154879 0.293572 -0.469711 -0.092778 0.054845 0.137802 -0.105442 0.299357 -0.470351 -0.096809 -0.062249 0.105709 0.153377 0.046763 0.133755 -0.097436 -0.073777 0.112892 0.153978 0.322623 -0.492325 -0.099481 0.060866 0.134172 -0.099665 0.291062 -0.467865 -0.091505 -0.067736 0.106719 0.153151 0.056093 0.134370 -0.099811 -0.067886 0.111037 0.156027 0.298473 -0.471422 -0.104127 0.057194 0.131949 -0.088851 0.254402 -0.445177
charge: -0.076612 0.371031 0.010103 -0.030016 0.009571 0.363248 0.013362 0.013233 -0.006351 -0.096863 0.197763 -0.034812 0.030902 -0.030988 0.030120 -0.034267 0.024433 0.035280 0.036053 0.022218 -0.050926 -0.204631 -0.238597 -0.220517 -0.237914 -0.203771 0.249086 0.232058 0.224261 0.232800 0.253876 0.262389 -0.069394 0.030931 0.035434 -0.098706 0.037546 0.262605 -0.069422 0.030469 0.034886 -0.468629 0.026014 0.263470 -0.098727 0.037803 0.261479 -0.468390 0.014144 0.261278 -0.070545 0.029954 0.033803 -0.099730 0.036590 0.260544 -0.069469 0.030847 0.033654 -0.473836 0.018898 0.260733 -0.099544 0.036735 0.261295 -0.467843 0.010442 0.259740 -0.070905 0.031603 0.034166 -0.101424 0.036141 0.260365 -0.069864 0.030337 0.034586 -0.473672 0.019614 0.260216 -0.101121 0.035787 0.260666 -0.483647 0.030817 0.261856 -0.069384 0.030601 0.034940 -0.099310 0.037318 0.262865 -0.068608 0.031680 0.035755 -0.469264 0.023457 0.262928 -0.099490 0.036968 0.261311 -0.474275 0.027719 0.261799 -0.069081 0.031261 0.035238 -0.099162 0.037442 0.261659 -0.067936 0.031404 0.035423 -0.467205 0.020711 0.263278 -0.099333 0.037832 0.261250 -0.466842 0.010906 0.261769 -0.070492 0.031001 0.034518 -0.097896 0.037975 0.264510 -0.068103 0.031159 0.035534 -0.455209 0.041119 0.264008 -0.097843 0.037899 0.262070 -0.468880 0.018484 0.259705 -0.070598 0.029969 0.034307 -0.100245 0.036779 0.262501 -0.068781 0.031429 0.035810 -0.468390 0.016621 0.261464 -0.100536 0.036508 0.259711 -0.493336 0.035506
qa: 0.2152 -0.2881 0.2017 0.2294 0.2006 -0.1391 0.2051 0.2052 0.1827 -0.4924 -0.1059 -0.0101 -0.1556 0.1444 -0.1593 -0.0060 0.1802 0.1731 0.1777 0.1897 -0.0347 0.2254 0.1657 0.2056 0.1514 0.2169 -0.2311 -0.1792 -0.1870 -0.1748 -0.2272 -0.1030 -0.0671 0.1083 0.1536 0.0405 0.1363 -0.0936 -0.0638 0.1073 0.1539 0.2751 -0.4685 -0.0961 0.0646 0.1420 -0.1078 0.3022 -0.4690 -0.1018 -0.0670 0.1052 0.1508 0.0536 0.1311 -0.1056 -0.0564 0.1060 0.1515 0.2840 -0.4421 -0.1046 0.0547 0.1326 -0.1052 0.2992 -0.4736 -0.0916 -0.0604 0.1021 0.1539 0.0596 0.1305 -0.1070 -0.0674 0.1071 0.1544 0.2858 -0.4468 -0.1046 0.0421 0.1314 -0.0875 0.2642 -0.4523 -0.0989 -0.0751 0.1087 0.1551 0.0618 0.1416 -0.0972 -0.0677 0.1117 0.1560 0.2797 -0.4688 -0.0888 0.0272 0.1342 -0.0933 0.2889 -0.4589 -0.1001 -0.0684 0.1085 0.1536 0.0435 0.1351 -0.0958 -0.0766 0.1128 0.1549 0.2936 -0.4697 -0.0928 0.0548 0.1378 -0.1054 0.2994 -0.4704 -0.0968 -0.0622 0.1057 0.1534 0.0468 0.1338 -0.0974 -0.0738 0.1129 0.1540 0.3226 -0.4923 -0.0995 0.0609 0.1342 -0.0997 0.2911 -0.4679 -0.0915 -0.0677 0.1067 0.1532 0.0561 0.1344 -0.0998 -0.0679 0.1110 0.1560 0.2985 -0.4714 -0.1041 0.0572 0.1319 -0.0889 0.2544 -0.4452
va: 2.7773 3.4812 0.9883 0.9987 0.9876 3.4858 0.9817 0.9823 1.0209 0.9261 3.4131 3.9023 3.8170 3.4071 3.8025 3.8928 0.9889 1.0041 1.0025 0.9848 3.5243 3.7221 3.8894 4.0559 3.9245 3.7117 1.0739 1.1178 1.1238 1.1056 1.0641 3.0511 3.8444 1.0586 0.9845 3.9772 0.9998 3.0510 3.8374 1.0607 0.9848 4.3472 2.0474 3.0634 3.9111 1.0001 3.0546 4.3399 2.0539 3.0363 3.8454 1.0635 0.9852 3.9654 1.0017 3.0354 3.8393 1.0606 0.9846 4.3450 2.0474 3.0454 3.9591 1.0010 3.0485 4.3539 2.0457 3.0527 3.8370 1.0650 0.9836 3.9365 1.0008 3.0389 3.8372 1.0615 0.9844 4.3453 2.0484 3.0321 3.9915 1.0013 3.0284 4.3685 2.0632 3.0594 3.8474 1.0598 0.9842 3.9145 0.9993 3.0671 3.8352 1.0580 0.9841 4.3432 2.0471 3.0454 3.9942 1.0004 3.0523 4.3429 2.0693 3.0418 3.8470 1.0592 0.9844 3.9803 1.0011 3.0359 3.8602 1.0534 0.9845 4.3316 2.0440 3.0692 3.9343 1.0003 3.0552 4.3541 2.0505 3.0457 3.8388 1.0623 0.9848 3.9766 1.0008 3.0482 3.8570 1.0527 0.9853 4.3014 2.0108 3.0485 3.9509 1.0009 3.0426 4.3558 2.0561 3.0514 3.8380 1.0627 0.9846 3.9418 1.0008 3.0573 3.8385 1.0578 0.9841 4.3268 2.0413 3.0371 3.9508 1.0009 3.0450 4.3929 2.0408
dispcorr: -0.499710940 hartree
energy: -5880.300117041545
dipole: -1.46280 0.79672 -0.66608 8.68123 -4.22053 4.46070 -625.54470 633.19166 7.64695
magnitude: 8.87792 au
magnitude: 22.56587 debye
elementType: H H H H F F F F F
paramagneticShielding: 59.252 67.162 67.270 59.004 504.667 492.832 469.011 493.362 503.651 ppm
diamagneticShielding: -36.644 -42.739 -42.823 -36.510 -201.108 -174.471 -132.429 -180.522 -205.161 ppm
total: 22.608 24.423 24.447 22.493 303.559 318.361 336.582 312.840 298.491 ppm
