program: Orca
programVersion: 5.0.4
elementType: Pt N H H H N H H H O H H N C C C C C H H H H C C C C C C H H H H H N C H H C H N C H H C O N C H N C O N C H H C H N C H H C O N C H N C O N C H H C H N C H H C O N C H N C O N C H H C H N C H H C O N C H N C O N C H H C H N C H H C O N C H N C O N C H H C H N C H H C O N C H N C O N C H H C H N C H H C O N C H N C O
elementType: Pt
keywords: B3LYP D3BJ def2-TZVPP def2/J RIJCOSX TightSCF CPCM(water) NMR
formula: C53H59N31O15Pt
InChI: InChI=1/C42H42N28O14.C11H9N.2H3N.H2O.Pt/c71-29-43-1-44-16-18-48(30(44)72)4-52-20-22-56(34(52)76)8-60-24-26-64(38(60)80)12-68-28-27-67(41(68)83)11-63-25-23-59(37(63)79)7-55-21-19-51(33(55)75)3-47(29)17-15(43)45-2-46(16)32(74)50(18)6-54(20)36(78)58(22)10-62(24)40(82)66(26)14-70(28)42(84)69(27)13-65(25)39(81)61(23)9-57(21)35(77)53(19)5-49(17)31(45)73;1-2-4-10(5-3-1)11-6-8-12-9-7-11;;;;/h15-28H,1-14H2;1-9H;2*1H3;1H2;/q;-1;;;;+1/rC42H42N28O14.C11H17N3OPt/c71-29-43-1-44-16-18-48(30(44)72)4-52-20-22-56(34(52)76)8-60-24-26-64(38(60)80)12-68-28-27-67(41(68)83)11-63-25-23-59(37(63)79)7-55-21-19-51(33(55)75)3-47(29)17-15(43)45-2-46(16)32(74)50(18)6-54(20)36(78)58(22)10-62(24)40(82)66(26)14-70(28)42(84)69(27)13-65(25)39(81)61(23)9-57(21)35(77)53(19)5-49(17)31(45)73;12-16(13,15)14-8-6-11(7-9-14)10-4-2-1-3-5-10/h15-28H,1-14H2;1-9H,15H2,12-13H3
159 atoms
Pt 0.006164 -0.023437 4.291413
N  -0.478151 1.960893 4.316413
H  -1.362231 2.119882 3.839464
H  0.22909 2.516479 3.841383
H  -0.574886 2.344263 5.252369
N  0.029543 -0.133567 6.363643
H  -0.860541 0.12142 6.782872
H  0.746653 0.454358 6.780431
H  0.227536 -1.090127 6.646803
O  0.457809 -2.087372 4.342934
H  1.298467 -2.320761 3.927284
H  -0.221953 -2.64411 3.940683
N  -0.00357 0.016421 2.239064
C  1.122445 0.280835 1.549733
C  1.156743 0.283261 0.171261
C  -0.000327 0.006313 -0.565739
C  -1.159794 -0.262531 0.170421
C  -1.128886 -0.249525 1.548843
H  2.003845 0.497472 2.133813
H  2.08785 0.523211 -0.319169
H  -2.089895 -0.505674 -0.320359
H  -2.011417 -0.462995 2.132463
C  0.002079 -0.002722 -2.0419
C  -1.132993 0.391911 -2.76115
C  -1.128102 0.386167 -4.149338
C  0.006164 -0.023437 -4.843408
C  1.13842 -0.422517 -4.140089
C  1.139251 -0.407723 -2.75196
H  -2.015751 0.729812 -2.23591
H  -2.009224 0.705875 -4.689008
H  0.007659 -0.031633 -5.925016
H  2.021062 -0.750338 -4.672368
H  2.020347 -0.738055 -2.21921
N  -4.18671 -3.20768 -1.23007
C  -3.5811 -4.40734 -1.76409
H  -3.45055 -4.26415 -2.83301
H  -4.25958 -5.24588 -1.58986
C  -4.96095 -3.18066 -0.00552
H  -5.68086 -4.00164 0.0042
N  -4.18983 -3.17828 1.22282
C  -3.59637 -4.37035 1.7887
H  -3.47495 -4.20355 2.85527
H  -4.27836 -5.20869 1.62795
C  -4.35261 -2.01554 1.94309
O  -3.89301 -1.78852 3.05157
N  -5.15067 -1.16692 1.20923
C  -5.61561 -1.76955 -0.0233
H  -6.70709 -1.78988 -0.04508
N  -5.10186 -1.17565 -1.24297
C  -4.31587 -2.04865 -1.96122
O  -3.84012 -1.84092 -3.06677
N  -0.11692 -5.23808 -1.19117
C  1.19039 -5.51751 -1.74385
H  1.14539 -5.32137 -2.81138
H  1.41986 -6.57259 -1.57703
C  -0.60663 -5.83063 0.03794
H  -0.39895 -6.90267 0.04846
N  -0.12805 -5.21624 1.26064
C  1.17986 -5.4767 1.82039
H  1.13252 -5.25998 2.88371
H  1.41617 -6.53366 1.6756
C  -1.13742 -4.61292 1.97693
O  -1.02575 -4.09796 3.07885
N  -2.30101 -4.72044 1.24871
C  -2.12315 -5.48309 0.02859
H  -2.77742 -6.35729 0.03105
N  -2.28907 -4.73774 -1.2038
C  -1.11977 -4.64451 -1.92454
O  -0.99833 -4.14732 -3.03343
N  4.02915 -3.35738 -1.20607
C  5.06268 -2.51159 -1.76103
H  4.8796 -2.42545 -2.8283
H  6.03095 -2.99035 -1.59504
C  4.18201 -4.09671 0.0316
H  5.1426 -4.61606 0.04501
N  4.01581 -3.32204 1.24604
C  5.05565 -2.48303 1.80121
H  4.86587 -2.38165 2.86602
H  6.01863 -2.97724 1.64984
C  2.90784 -3.70733 1.96753
O  2.57891 -3.2758 3.06155
N  2.25139 -4.68561 1.25497
C  2.95109 -5.0481 0.0381
H  3.21197 -6.10831 0.05442
N  2.26554 -4.72007 -1.19656
C  2.93109 -3.7638 -1.93042
O  2.61832 -3.36669 -3.04229
N  5.14485 1.05511 -1.22766
C  5.11669 2.3888 -1.78719
H  4.92577 2.29587 -2.85257
H  6.09448 2.85085 -1.63163
C  5.84801 0.71708 -0.00552
H  6.85462 1.13993 -0.02098
N  5.17305 1.0763 1.22631
C  5.15865 2.4183 1.7660
H  4.99058 2.34154 2.83652
H  6.13244 2.87768 1.58116
C  4.80235 -0.02554 1.96355
O  4.30156 -0.00793 3.07743
N  5.12531 -1.15175 1.24085
C  5.82015 -0.83867 0.00727
H  6.8108 -1.29801 0.00625
N  5.11229 -1.17378 -1.21255
C  4.76525 -0.05863 -1.94227
O  4.23847 -0.0584 -3.04417
N  2.38512 4.67962 -1.23659
C  1.32722 5.49931 -1.78507
H  1.28103 5.30971 -2.85368
H  1.57791 6.54857 -1.61233
C  3.08298 4.99962 -0.00815
H  3.36667 6.05406 0.00033
N  2.38228 4.65905 1.21572
C  1.32054 5.46857 1.7735
H  1.27199 5.26033 2.83853
H  1.56828 6.52165 1.61896
C  3.03838 3.69219 1.94469
O  2.71914 3.28982 3.05276
N  4.13446 3.28132 1.21995
C  4.29328 4.02271 -0.01441
H  5.26375 4.52285 -0.03113
N  4.10278 3.25904 -1.23262
C  3.01558 3.6915 -1.95915
O  2.68432 3.28871 -3.06368
N  -2.16228 4.76009 -1.24268
C  -3.45821 4.44472 -1.80313
H  -3.32552 4.28508 -2.86945
H  -4.12311 5.29681 -1.64339
C  -1.98613 5.50568 -0.01137
H  -2.63309 6.38575 -0.00824
N  -2.16896 4.7472 1.2101
C  -3.47011 4.43216 1.75716
H  -3.35071 4.26639 2.82412
H  -4.13081 5.28666 1.59162
C  -1.00464 4.62822 1.93588
O  -0.89512 4.11393 3.03832
N  0.00958 5.21874 1.21556
C  -0.46669 5.83907 -0.00552
H  -0.24854 6.90896 0.00565
N  0.0133 5.24382 -1.23694
C  -0.9964 4.66003 -1.96815
O  -0.88321 4.16555 -3.07915
N  -5.0667 1.26149 -1.25557
C  -5.62399 0.04795 -1.81081
H  -5.4028 0.03787 -2.87433
H  -6.70693 0.06467 -1.66577
C  -5.56242 1.87907 -0.04035
H  -6.65292 1.9305 -0.06161
N  -5.11427 1.27118 1.19645
C  -5.6900 0.06334 1.74554
H  -5.50503 0.06642 2.81601
H  -6.76695 0.07784 1.56242
C  -4.29279 2.10213 1.92432
O  -3.84116 1.87005 3.03508
N  -4.09573 3.25403 1.19648
C  -4.86513 3.2695 -0.0331
H  -5.55986 4.11181 -0.03289
N  -4.08671 3.26311 -1.25555
C  -4.2442 2.09968 -1.97471
O  -3.76186 1.86397 -3.07191
elementType: Pt N H O C
totalener: -4999.72761037 hartree
cpcmener: -0.38928945 hartree
kineticenergy: 4899.86681035 hartree
exchangeener: -506.409315783858 hartree
correlationener: -30.212180495947 hartree
xcener: -536.621496279805 hartree
chargesum: 2.0000000
charge: 0.319659 -0.156179 0.198982 0.199326 0.191893 -0.178288 0.211821 0.212214 0.202431 -0.364034 0.282680 0.283953 -0.138223 -0.009832 -0.169143 0.102835 -0.162155 -0.015625 0.186467 0.186336 0.182342 0.196919 0.073682 -0.193819 -0.215812 -0.142130 -0.185979 -0.174061 0.206215 0.154391 0.163706 0.152397 0.156985 -0.100158 -0.068089 0.109417 0.155148 0.050461 0.137237 -0.098177 -0.064082 0.112047 0.156825 0.272125 -0.464880 -0.095599 0.058104 0.142056 -0.103236 0.287475 -0.460780 -0.104820 -0.068277 0.108984 0.154393 0.054824 0.136661 -0.095636 -0.078981 0.115838 0.157156 0.339215 -0.501874 -0.100459 0.059360 0.137941 -0.107081 0.299235 -0.468760 -0.103692 -0.066786 0.111559 0.158554 0.054916 0.137495 -0.098747 -0.066966 0.111971 0.158154 0.341542 -0.500130 -0.093709 0.048144 0.137688 -0.098595 0.295597 -0.460710 -0.094095 -0.073493 0.109974 0.156233 0.050085 0.142569 -0.096477 -0.068150 0.112212 0.157205 0.276052 -0.465424 -0.094884 0.045319 0.137482 -0.101085 0.285436 -0.458231 -0.100480 -0.068325 0.108852 0.154633 0.046895 0.136205 -0.097777 -0.073664 0.112068 0.154710 0.297919 -0.472625 -0.095079 0.056226 0.138268 -0.103922 0.298621 -0.469848 -0.105914 -0.059430 0.108267 0.154467 0.052426 0.135053 -0.098706 -0.071089 0.112208 0.154823 0.329281 -0.495907 -0.098605 0.057271 0.134935 -0.102837 0.298700 -0.469818 -0.098436 -0.068561 0.111850 0.156157 0.072051 0.138511 -0.101073 -0.068246 0.112271 0.157389 0.304178 -0.475421 -0.101100 0.044034 0.135990 -0.090951 0.260110 -0.457131
charge: 0.264441 0.392184 -0.002038 -0.005729 0.019381 0.373550 0.017736 0.018174 0.013176 0.435449 -0.138159 -0.127031 0.192308 -0.035034 0.026576 -0.020994 0.026629 -0.035114 0.028897 0.034324 0.034346 0.028377 -0.069229 0.010843 -0.019810 -0.011498 -0.018445 0.010855 0.018427 0.019298 0.022615 0.019967 0.021831 0.262625 -0.068447 0.031481 0.036014 -0.098323 0.038006 0.262678 -0.066673 0.032104 0.036725 -0.470225 0.021102 0.263677 -0.098379 0.038271 0.261753 -0.469968 0.021146 0.261735 -0.068327 0.031523 0.035223 -0.096546 0.038950 0.265780 -0.064909 0.033042 0.037314 -0.449338 0.055277 0.266714 -0.096307 0.038909 0.261978 -0.466212 0.012618 0.262206 -0.068260 0.032035 0.035731 -0.096689 0.039010 0.266737 -0.066697 0.032225 0.036716 -0.447143 0.064903 0.266026 -0.097018 0.038727 0.262153 -0.467387 0.027885 0.263002 -0.068439 0.031292 0.035537 -0.098380 0.038123 0.263261 -0.068110 0.031973 0.036174 -0.470526 0.020333 0.263045 -0.098118 0.038052 0.262304 -0.471021 0.035968 0.262048 -0.068719 0.031491 0.035456 -0.098885 0.037691 0.261987 -0.067507 0.031427 0.035635 -0.466416 0.021318 0.263541 -0.099028 0.038081 0.261484 -0.466990 0.012480 0.261649 -0.068255 0.031493 0.035534 -0.097588 0.038305 0.264350 -0.067163 0.031548 0.036044 -0.455716 0.051172 0.264158 -0.097659 0.038125 0.262054 -0.467255 0.014147 0.262738 -0.068519 0.031460 0.035480 -0.097867 0.038256 0.263628 -0.068023 0.031906 0.036421 -0.466224 0.021905 0.262304 -0.097912 0.037871 0.263320 -0.470460 0.040760
qa: 0.3197 -0.1562 0.1990 0.1993 0.1919 -0.1783 0.2118 0.2122 0.2024 -0.3640 0.2827 0.2840 -0.1382 -0.0098 -0.1691 0.1028 -0.1622 -0.0156 0.1865 0.1863 0.1823 0.1969 0.0737 -0.1938 -0.2158 -0.1421 -0.1860 -0.1741 0.2062 0.1544 0.1637 0.1524 0.1570 -0.1002 -0.0681 0.1094 0.1551 0.0505 0.1372 -0.0982 -0.0641 0.1120 0.1568 0.2721 -0.4649 -0.0956 0.0581 0.1421 -0.1032 0.2875 -0.4608 -0.1048 -0.0683 0.1090 0.1544 0.0548 0.1367 -0.0956 -0.0790 0.1158 0.1572 0.3392 -0.5019 -0.1005 0.0594 0.1379 -0.1071 0.2992 -0.4688 -0.1037 -0.0668 0.1116 0.1586 0.0549 0.1375 -0.0987 -0.0670 0.1120 0.1582 0.3415 -0.5001 -0.0937 0.0481 0.1377 -0.0986 0.2956 -0.4607 -0.0941 -0.0735 0.1100 0.1562 0.0501 0.1426 -0.0965 -0.0681 0.1122 0.1572 0.2761 -0.4654 -0.0949 0.0453 0.1375 -0.1011 0.2854 -0.4582 -0.1005 -0.0683 0.1089 0.1546 0.0469 0.1362 -0.0978 -0.0737 0.1121 0.1547 0.2979 -0.4726 -0.0951 0.0562 0.1383 -0.1039 0.2986 -0.4698 -0.1059 -0.0594 0.1083 0.1545 0.0524 0.1351 -0.0987 -0.0711 0.1122 0.1548 0.3293 -0.4959 -0.0986 0.0573 0.1349 -0.1028 0.2987 -0.4698 -0.0984 -0.0686 0.1118 0.1562 0.0721 0.1385 -0.1011 -0.0682 0.1123 0.1574 0.3042 -0.4754 -0.1011 0.0440 0.1360 -0.0910 0.2601 -0.4571
va: 2.6141 3.5835 1.0188 1.0190 0.9892 3.5170 0.9801 0.9802 0.9908 2.2907 1.0205 1.0146 3.4004 3.8771 3.8267 3.4927 3.8334 3.8809 0.9745 0.9843 0.9901 0.9621 3.3826 3.8375 3.9629 3.9102 3.9535 3.8416 0.9322 1.0170 0.9865 1.0162 0.9781 3.0519 3.8448 1.0581 0.9841 3.9648 0.9996 3.0530 3.8377 1.0545 0.9844 4.3538 2.0478 3.0662 3.9225 0.9997 3.0565 4.3454 2.0595 3.0422 3.8482 1.0598 0.9842 3.9634 1.0009 3.0545 3.8682 1.0486 0.9845 4.2718 2.0042 3.0838 3.9487 0.9999 3.0508 4.3579 2.0525 3.0579 3.8363 1.0572 0.9835 3.9518 0.9999 3.0761 3.8364 1.0553 0.9838 4.2652 2.0050 3.0540 3.9747 1.0001 3.0456 4.3462 2.0569 3.0710 3.8438 1.0588 0.9842 3.9343 0.9990 3.0640 3.8373 1.0567 0.9837 4.3496 2.0478 3.0500 3.9683 0.9995 3.0550 4.3369 2.0545 3.0473 3.8452 1.0588 0.9841 3.9739 1.0009 3.0404 3.8550 1.0540 0.9848 4.3261 2.0412 3.0698 3.9306 1.0001 3.0595 4.3481 2.0499 3.0398 3.8314 1.0599 0.9845 3.9640 1.0006 3.0550 3.8530 1.0536 0.9849 4.2851 1.9929 3.0550 3.9575 1.0007 3.0437 4.3523 2.0480 3.0626 3.8404 1.0574 0.9846 3.9066 0.9995 3.0701 3.8389 1.0562 0.9838 4.3169 2.0383 3.0404 3.9692 1.0010 3.0525 4.3647 2.0456
dispcorr: -0.494766100 hartree
energy: -5000.222376474338
dipole: -1.33760 1.18453 -0.15307 4.17712 -3.96472 0.21240 -566.68945 577.82749 11.13804
magnitude: 11.14112 au
magnitude: 28.31847 debye
elementType: H H H H H H H H H
paramagneticShielding: 64.678 69.523 69.460 64.621 63.623 43.398 36.976 43.475 63.846 ppm
diamagneticShielding: -41.690 -45.350 -45.288 -41.662 -40.005 -19.862 -13.316 -19.900 -40.028 ppm
total: 22.988 24.173 24.172 22.959 23.618 23.536 23.660 23.575 23.818 ppm
