program: Gaussian 16
title: Title Card Required
version: ES64L-G16RevC.01
method: RmPW1PW91
basis: 6-31+G(d,p)
operation: Freq
keyword: #N
keyword: Geom=AllCheck
keyword: Guess=TCheck
keyword: SCRF=Check
keyword: GenChk
keyword: RmPW1PW91/6-31+G(d,p)
keyword: Freq
converged: YES YES NO YES
title: Mulliken charges:
elementType: C C C C C C H H H H H C H H C H C H H C H C H H H C H H H C H H H C H H C H H C H H C C H C H H H C O O
charge: 0.063398 -0.506493 0.193293 -0.691204 0.239746 -0.914880 0.192736 0.162048 0.157092 0.158013 0.165538 -0.285705 0.152862 0.192735 0.368444 0.149403 -0.541262 0.170199 0.170849 0.199597 0.163645 -0.583669 0.157348 0.161802 0.164949 -0.591782 0.161962 0.166007 0.162943 -0.491720 0.168246 0.183859 0.185035 -0.372401 0.155428 0.145307 -0.355995 0.188105 0.169561 -0.486543 0.190589 0.173835 -0.171780 0.739905 0.141457 -0.520584 0.175570 0.180693 0.170255 0.173367 -0.122039 -0.379768
chargesum: -0.00000
title: Mulliken charges with hydrogens summed into heavy atoms:
elementType: C C C C C C C C C C C C C C C C C C C C O O
charge: 0.378503 -0.151709 0.193293 -0.691204 0.405284 -0.914880 0.059892 0.517847 -0.200214 0.363242 -0.099569 -0.100870 0.045420 -0.071665 0.001672 -0.122118 -0.030323 0.739905 0.005935 0.173367 -0.122039 -0.379768
1716.lowfreq: -4.1741 -0.0006 0.0007 0.0009 3.2374 4.5591 51.8614 57.9562 70.7459
frequency: 51.8605 57.9545 70.7455 85.4865 105.2302 115.3601 139.3552 153.1028 172.0261 198.5205 214.4578 228.1315 240.7627 248.0512 259.7289 267.0636 284.9511 288.4066 294.6847 309.4967 313.8153 315.4554 343.0166 363.3050 374.4158 390.6255 414.7595 424.4786 448.4064 462.7925 485.9503 549.6509 565.5556 579.2455 598.4479 635.3073 666.5590 684.7204 715.5583 717.6460 748.8935 768.7895 796.9795 833.0224 848.5984 869.3680 886.3024 902.7474 915.5294 930.2261 932.2880 941.0774 952.1190 954.3850 963.0393 975.1780 985.6918 991.1689 1004.8689 1013.5804 1020.2629 1028.1789 1035.4217 1052.6086 1063.5336 1070.5002 1083.7882 1101.2005 1108.3430 1145.6597 1151.8118 1158.5398 1163.3333 1176.6041 1194.3574 1204.4090 1208.0700 1222.6032 1239.3331 1252.1502 1261.4193 1264.8067 1265.5742 1283.6651 1288.1708 1298.9726 1309.2766 1315.0648 1322.4001 1339.5004 1344.6785 1350.8133 1355.9211 1361.8760 1367.6136 1372.9811 1383.3590 1399.0110 1408.2421 1412.3878 1421.7450 1428.6313 1438.5381 1459.1274 1488.8291 1491.1948 1492.9425 1496.9217 1501.0311 1503.5341 1505.1182 1512.4811 1514.8321 1516.9326 1518.2777 1519.6039 1523.1824 1527.7508 1728.9717 1919.4316 3006.5468 3046.2767 3047.8944 3054.7832 3057.4686 3060.4371 3063.9941 3074.1768 3074.8798 3077.9986 3083.6364 3087.7712 3092.0544 3115.9294 3122.8068 3128.1037 3132.4091 3133.3201 3138.1691 3143.1077 3143.5445 3145.2139 3152.5409 3153.2047 3154.6776 3156.3610 3180.0608 3183.3218 3191.4272 3272.0195
redmass: 3.2432 3.0374 3.2109 2.7906 3.4946 2.5367 3.8606 3.4808 2.9088 2.4262 1.7424 1.3090 1.6145 2.0418 2.0923 1.7093 1.6924 1.6746 2.1451 2.7705 2.0294 2.4371 2.3954 2.4606 2.5080 2.6084 2.8254 3.1328 3.1785 2.3779 3.0219 3.1650 3.1253 2.5898 2.7425 2.3530 4.3188 2.3625 2.2816 3.7373 3.0834 2.8247 2.7665 2.7050 1.7540 1.8169 3.4514 2.1389 2.0447 2.5769 1.1800 1.8033 1.3908 1.7345 2.0694 1.5756 1.7168 2.2497 1.9478 2.0348 1.9932 1.6645 1.2526 1.5896 2.1191 2.1108 1.7343 2.7419 1.8496 2.1844 1.7942 2.2687 2.2779 2.6164 2.0693 2.0489 2.7671 2.2897 2.4234 2.1417 1.5142 2.0339 1.6154 1.8066 1.7157 1.3085 1.5446 1.7785 1.4626 1.3422 1.3843 1.6321 1.4305 1.6042 1.5758 1.3609 1.5176 1.6125 1.3060 1.2616 1.4453 1.2638 1.4111 1.1995 1.0638 1.0648 1.0737 1.0567 1.0536 1.0577 1.0620 1.0718 1.0730 1.0731 1.0753 1.0777 1.0502 1.0831 4.8735 12.7782 1.0824 1.0722 1.0810 1.0391 1.0750 1.0428 1.0393 1.0619 1.0632 1.0626 1.0410 1.0621 1.0619 1.1018 1.1027 1.1011 1.1007 1.1002 1.0947 1.1042 1.1040 1.1027 1.1002 1.1003 1.1021 1.0982 1.0678 1.0979 1.0819 1.1160
irintensity: 0.0405 1.0310 0.7865 0.2005 0.1910 0.4801 2.3979 0.7316 0.3228 0.2581 0.3751 0.1975 0.3445 1.0231 1.6886 0.2243 0.3581 0.1233 1.0573 0.5310 0.9577 1.2275 0.6158 0.3541 0.1569 0.1077 0.6639 0.1092 0.1818 0.1281 0.1823 0.7913 1.6427 1.6264 1.3018 0.2190 1.3920 4.2737 6.1197 6.6190 6.9623 3.4537 4.8367 5.1315 0.6156 1.4845 32.6199 3.9634 4.8359 16.3313 1.7805 5.6269 36.9294 5.0771 14.0537 0.7405 6.4213 11.6373 0.0064 8.4804 3.7159 7.3120 19.2933 8.6747 1.8511 12.6652 1.9815 5.1386 1.6257 0.5489 0.7259 0.3597 6.3162 29.3007 19.6203 8.0270 37.3420 2.0429 5.0124 11.6190 5.8711 5.5038 3.3323 2.6093 6.8849 0.6782 5.0535 11.6069 4.3985 0.2447 2.0618 1.8652 0.3402 12.1528 4.8630 2.8277 2.0712 3.4772 10.6731 14.8962 8.2933 11.7506 4.3917 7.3978 2.6962 5.5459 4.6511 3.4377 4.0002 0.3040 16.3259 4.4910 7.9349 2.2304 3.2606 8.4467 18.9935 3.3899 15.7861 487.9392 13.9300 11.1835 10.4006 28.4216 11.3018 49.6676 28.4725 10.7914 37.4583 48.3304 26.2153 13.9361 32.9692 16.1458 6.5545 1.2926 19.8253 77.6654 23.6302 1.4080 59.1269 16.1878 14.6702 40.5343 25.6047 31.1675 11.9811 16.7530 6.8213 11.3846
temp: 298.150 k
press: 1.00000 atm
elementType: 6 6 6 6 6 6 1 1 1 1 1 6 1 1 6 1 6 1 1 6 1 6 1 1 1 6 1 1 1 6 1 1 1 6 1 1 6 1 1 6 1 1 6 6 1 6 1 1 1 6 8 8
symmnumber: 1
zpe: 1228676.1 jmol-1
zpe.correction: 0.467978 hartree
zpe.thermalcorrener: 0.489240 hartree
zpe.thermalcorrenthalpy: 0.490185 hartree
zpe.thermalcorrgfe: 0.420537 hartree
zpe.sumelectzpe: -930.021391 hartree
zpe.sumelectthermal: -930.000129 hartree
zpe.sumelectthermalent: -929.999184 hartree
zpe.sumelectthermalfe: -930.068832 hartree
dipole: 1.5620 1.9870 3.8343
dipole: 4.5924
quadrupole: -134.0750 -140.8733 -142.1055
quadrupole: -4.4493 -8.7508 -7.9166
quadrupole: 4.9430 -1.8554 -3.0876 -4.4493 -8.7508 -7.9166
hfenergy: -930.489369 hartree
pointgroup: C01 [X(C20H30O2)]
dipole: -0.6248384 0.8149236 -1.4865835 debye
polarizability: 256.7000898|3.6395234|214.952877|5.0186033|4.2842316|189.3126731 unknown
InChI: InChI=1/20C.2O.30H
charge 0 multiplicity 1
52 atoms
C  -1.17002316 -1.36819899 -1.10738871
C  0.13472051 -2.17198167 -0.94410141
C  1.33606494 -1.3682141 -0.42614152
C  1.1667719 0.11971192 0.01918977
C  -0.2316339 0.68114097 -0.08866109
C  -1.39305603 -0.3484223 0.01569614
H  -0.03359732 -3.01236161 -0.26320265
H  0.39377277 -2.62116872 -1.9081587
H  -1.1488625 -0.82321291 -2.06061346
H  -1.99595772 -2.07875855 -1.18120536
H  -0.30761212 1.04059281 -1.12313007
C  -0.65361258 1.84074129 0.81228526
H  -0.19265925 2.78644071 0.51558649
H  -0.35563695 1.65007715 1.84687136
C  -2.59223124 0.62808414 -0.18510458
H  -2.58316798 0.91285117 -1.24959453
C  -2.18921841 1.87332091 0.65295219
H  -2.52172141 2.79533429 0.17003156
H  -2.68152757 1.8417146 1.63089836
C  -4.02321162 0.15976415 0.13450923
H  -4.06926605 -0.07465761 1.20692271
C  -4.46402571 -1.08268594 -0.64118504
H  -3.90682572 -1.97680297 -0.35473783
H  -5.52264873 -1.28970675 -0.45692447
H  -4.33983628 -0.93908075 -1.72026853
C  -5.02143711 1.29308277 -0.12810733
H  -6.04050677 0.97089516 0.1053676
H  -4.81141495 2.18079233 0.47290496
H  -5.00289374 1.59048865 -1.18305482
C  -1.51437968 -1.04336596 1.379308
H  -2.41848928 -1.65795938 1.40485442
H  -0.68005709 -1.70601951 1.60695752
H  -1.58128375 -0.32495563 2.1998358
C  4.07352712 2.23239228 0.75293209
H  4.30782176 3.08378529 1.38269765
H  4.89815123 1.57316468 0.50254759
C  2.61325293 -1.41727952 -1.27039796
H  3.15271085 -2.35882473 -1.13534548
H  2.34348155 -1.34388213 -2.32955765
C  3.41498595 -0.19711928 -0.8167338
H  3.92970415 -0.4230163 0.12243916
H  4.17671503 0.10489551 -1.53991729
C  2.8294068 2.0214399 0.32648965
C  2.36483583 0.91247988 -0.58430923
H  2.05863154 2.73253462 0.61763151
C  1.97929877 1.54510294 -1.93503174
H  1.27652821 2.37274013 -1.80855606
H  2.87617989 1.94700035 -2.41261193
H  1.52591829 0.81943271 -2.61742626
C  1.65434908 -1.56967633 1.05122597
O  1.51378547 -0.26835984 1.40428691
O  1.93461806 -2.49321683 1.76042961
