program: Gaussian 09
title: 000050496
version: EM64L-G09RevD.01
frameworkgroup: C1[X(C19H19N3O2)]
method: RPBEPBE
basis: SDD
operation: Freq
keyword: #p
keyword: freq=noraman
keyword: PBEPBE/SDD
title: #p freq=noraman PBEPBE/SDD
converged: YES YES NO NO
title: Mulliken charges:
elementType: O O N N N C C C C C C C C C C C C C C C C C C C H H H H H H H H H H H H H H H H H H H
charge: -0.236505 -0.241528 -0.261605 -0.173166 -0.650089 -0.426912 -0.433364 -0.394000 -0.395688 0.317547 0.441264 0.239742 0.069225 0.169946 -0.368053 -0.372010 -0.354648 0.084923 -0.352295 -0.229015 -0.227434 -0.275367 -0.225961 -0.268714 0.241877 0.223355 0.241190 0.229780 0.230981 0.204346 0.229087 0.209142 0.233041 0.229761 0.238678 0.262749 0.322895 0.339030 0.219155 0.219069 0.228239 0.235064 0.226267
chargesum: 0.00000
title: Mulliken charges with hydrogens summed into heavy atoms:
elementType: O O N N N C C C C C C C C C C C C C C C C C C C
charge: -0.236505 -0.241528 -0.261605 -0.173166 0.011836 0.038321 0.037606 0.041327 0.042540 0.317547 0.441264 0.239742 0.069225 0.169946 -0.135013 -0.142249 -0.115969 0.084923 -0.089546 -0.009860 -0.008365 -0.047128 0.009103 -0.042447
polarizability: 3.40911217e+02 -2.40040267e+00 2.90944487e+02 -3.99058594e-02 2.26908303e+00 1.16809213e+02
1716.lowfreq: -6.4641 -1.1752 0.0004 0.0005 0.0008 5.4003 16.4329 27.2237 44.0906
frequency: 16.3940 27.0245 44.0868 62.0457 90.5101 100.5986 115.9571 131.8483 157.5072 161.8326 196.6738 216.5754 253.0654 270.2249 285.3095 288.2303 313.2125 350.4412 374.7555 384.5944 413.6512 426.7721 430.9735 447.9290 462.6567 476.1928 511.2726 515.5623 536.5942 558.9568 563.7067 597.8778 613.6099 624.3915 629.3110 639.3158 669.2535 691.4898 711.6954 715.5067 746.8467 752.6872 764.8039 774.8905 809.8397 854.1124 864.0434 870.4085 881.5946 883.3447 927.2019 944.9117 953.7060 954.8423 975.1338 976.4234 980.6820 1005.2085 1029.6742 1032.1757 1048.8134 1062.5592 1074.3886 1077.0562 1083.7703 1090.7248 1107.0708 1167.0478 1170.7212 1173.3062 1187.2442 1188.6500 1194.2927 1200.6179 1230.6080 1247.6375 1260.9404 1272.7486 1299.3864 1333.6196 1341.5807 1343.8606 1355.4833 1364.6916 1375.9736 1378.2983 1388.6113 1390.8817 1402.8917 1446.2394 1449.2176 1474.3163 1476.2991 1477.6695 1492.8294 1497.9440 1501.3575 1550.4697 1577.4447 1577.7577 1603.3767 1610.0231 1621.7411 1640.3747 2899.3185 2909.2631 2923.1151 2948.4751 3012.2649 3017.5061 3022.8809 3039.3375 3121.8746 3127.9941 3136.3841 3150.4251 3151.6000 3154.7553 3163.9009 3168.4695 3177.4143 3515.3045 3668.8451
redmass: 5.4857 4.0766 4.9170 5.2690 3.3794 5.5360 4.9742 4.6796 3.3584 6.2362 4.1457 4.1981 4.7189 1.9291 5.1236 3.3467 3.2987 5.2005 4.3247 4.5423 2.9634 5.9707 4.0280 6.0817 3.1603 2.9806 2.6455 1.4712 3.5193 1.8005 1.9865 2.3731 6.3487 4.5833 5.9799 5.4273 6.3806 1.8199 4.4659 6.4261 4.6741 1.8892 1.3184 4.1459 1.2913 1.5065 1.4227 1.5272 5.3068 4.1488 3.8769 1.3889 1.3856 2.0241 1.3110 5.2627 1.3127 2.6259 2.1583 2.0678 2.1255 2.2239 2.9493 2.2706 2.4686 1.6293 1.8656 1.1711 1.5325 1.4950 1.7773 1.8416 1.8334 1.1652 1.4174 1.9377 1.5775 1.4604 1.7615 1.4097 1.6506 2.0306 1.7139 1.3830 1.8610 1.8037 3.9744 3.4598 6.1218 2.6897 2.4996 2.2284 1.2336 1.1665 1.0880 1.1274 2.3079 2.3344 5.9913 2.4870 5.0637 8.5475 6.0288 6.6768 1.0704 1.0711 1.0675 1.0693 1.0945 1.0902 1.0918 1.0925 1.0844 1.0882 1.0853 1.0912 1.0894 1.0945 1.0949 1.1007 1.0996 1.0435 1.1046
irintensity: 0.9753 1.5332 0.6405 1.4273 2.2969 0.5364 1.0441 1.7454 9.5199 1.2911 0.6267 2.2771 1.5615 0.2865 2.4446 4.0573 5.2948 9.9962 4.9100 3.3474 0.5247 1.6929 1.5981 0.4616 3.7523 16.2639 4.7364 237.8759 20.0678 15.6723 9.3036 2.7857 0.2682 4.0716 1.0511 1.4377 1.5147 42.2215 1.9346 6.8198 10.5512 71.0292 96.3692 1.9432 0.1164 1.2487 4.8578 3.2634 5.0249 4.5481 37.8435 4.5975 0.0239 0.8093 0.5595 8.3120 1.6338 61.7258 25.8569 2.8429 4.3075 10.6680 118.2639 20.3436 20.1205 6.8950 27.5801 2.7453 15.5953 14.0648 16.8447 49.8390 41.0559 17.7621 60.4105 12.7557 1.0362 52.8220 9.2653 0.4408 5.5978 11.8869 46.1599 9.1088 2.1705 147.1873 54.7540 14.8877 57.8706 22.5130 0.0046 60.2649 86.6716 15.0501 7.4937 3.2627 141.3996 146.1811 6.5699 142.0483 179.9789 237.2141 241.6418 354.9107 76.9948 46.8035 82.3088 72.1504 18.4558 41.8042 24.7711 23.4707 12.2358 9.0717 1.9510 38.3072 8.9384 37.0489 16.3565 9.4092 14.6830 102.9860 59.4568
temp: 298.150 k
press: 1.00000 atm
elementType: 8 8 7 7 7 6 6 6 6 6 6 6 6 6 6 6 6 6 6 6 6 6 6 6 1 1 1 1 1 1 1 1 1 1 1 1 1 1 1 1 1 1 1
symmnumber: 1
zpe: 904256.0 jmol-1
zpe.correction: 0.344413 hartree
zpe.thermalcorrener: 0.364648 hartree
zpe.thermalcorrenthalpy: 0.365592 hartree
zpe.thermalcorrgfe: 0.294437 hartree
zpe.sumelectzpe: -1048.403709 hartree
zpe.sumelectthermal: -1048.383473 hartree
zpe.sumelectthermalent: -1048.382529 hartree
zpe.sumelectthermalfe: -1048.453685 hartree
dipole: -3.2516 1.6939 0.3827
dipole: 3.6863
quadrupole: -171.0104 -128.1010 -143.9151
quadrupole: 18.3065 -0.1533 1.3372
quadrupole: -23.3349 19.5745 3.7604 18.3065 -0.1533 1.3372
hfenergy: -1048.7481216 hartree
pointgroup: C01 [X(C19H19N3O2)]
dipole: -1.2656282 0.6666568 0.2390756 debye
polarizability: 340.7948566|-3.3640782|287.5671631|-0.4936811|24.5301146|120.3028977 unknown
InChI: InChI=1S/C19H19N3O2/c20-17-18(15-8-4-5-9-16(15)24-19(17)23)22-12-10-21(11-13-22)14-6-2-1-3-7-14/h1-9H,10-13,20H2
charge 0 multiplicity 1
43 atoms
O  4.608404 -0.625259 -0.125784
O  4.545685 -2.922234 -0.289257
N  0.326766 -0.598551 0.127688
N  -2.545422 -0.109871 0.002633
N  1.792583 -3.006385 -0.10793
C  -0.454892 -0.865624 -1.101495
C  -0.40278 0.030603 1.253418
C  -1.912967 -1.20956 -0.750176
C  -1.662449 0.783669 0.775364
C  1.748314 -0.561195 0.03934
C  -3.938486 0.074389 -0.0179
C  2.51653 0.680254 0.041235
C  2.430438 -1.778995 -0.087089
C  3.94079 0.611619 -0.018293
C  -4.808501 -0.941661 -0.525293
C  -4.534442 1.281604 0.465364
C  1.936398 1.984259 0.057957
C  3.898947 -1.851391 -0.193237
C  4.758281 1.757243 -0.008845
C  -6.204793 -0.750312 -0.546162
C  -5.933402 1.452461 0.445587
C  2.739157 3.138071 0.062493
C  4.154647 3.02928 0.042215
C  -6.785703 0.443709 -0.06014
H  -0.001729 -1.714749 -1.648773
H  -0.444253 0.009415 -1.789958
H  0.261856 0.732247 1.789314
H  -0.715242 -0.741199 1.988334
H  -2.465052 -1.369423 -1.695903
H  -1.943738 -2.167749 -0.182197
H  -2.202708 1.141378 1.671735
H  -1.370695 1.682952 0.185948
H  -4.400559 -1.893659 -0.878778
H  -3.907493 2.101627 0.828864
H  0.846432 2.080734 0.040794
H  5.844055 1.631809 -0.053624
H  0.813277 -3.050877 0.167154
H  2.372308 -3.844861 -0.133971
H  -6.844699 -1.550424 -0.936742
H  -6.358962 2.391406 0.819131
H  2.269259 4.127221 0.072599
H  4.778405 3.928825 0.050037
H  -7.871165 0.584605 -0.075857
