program: Gaussian 16
title: [B12I11(Leu-Pro)](2-)
version: ES64L-G16RevC.02
frameworkgroup: C1[X(C11H19B12I11N2O3)]
method: RB3LYP
basis: def2TZVPP
operation: Freq
keyword: #P
keyword: Geom=AllCheck
keyword: Guess=TCheck
keyword: SCRF=Check
keyword: GenChk
keyword: RB3LYP/def2TZVPP
keyword: Freq
converged: YES YES YES YES
title: Mulliken charges:
elementType: B B B B B B B B B B B B I I I I I I I I I I I C H C H C H C O C H H H N C C H C C H H H H H H C H H H N H H C O O H
charge: 0.169611 0.024737 0.034071 -0.397821 -0.381618 0.095797 0.262759 -0.099251 -0.004726 0.170449 0.077177 0.043354 -0.186290 -0.148250 -0.187466 -0.186801 -0.188441 -0.183693 -0.183901 -0.181932 -0.189487 -0.196803 -0.149247 0.099151 0.040693 0.082600 0.088337 0.173795 0.071864 0.142430 -0.414781 -0.289895 0.043565 0.084945 0.055198 -0.082199 -0.060336 0.133691 0.072851 -0.119607 -0.139515 0.079939 0.051019 0.056904 0.074847 0.066790 0.086061 -0.309495 0.048975 0.099287 0.058127 -0.366784 0.151781 0.103258 0.237974 -0.331116 -0.285159 0.182579
chargesum: -2.00000
title: Mulliken charges with hydrogens summed into heavy atoms:
elementType: B B B B B B B B B B B B I I I I I I I I I I I C C C C O C N C C C C C N C O O
charge: 0.169611 0.024737 0.034071 -0.397821 -0.381618 0.095797 0.262759 -0.099251 -0.004726 0.170449 0.077177 0.043354 -0.186290 -0.148250 -0.187466 -0.186801 -0.188441 -0.183693 -0.183901 -0.181932 -0.189487 -0.196803 -0.149247 0.139844 0.170937 0.245659 0.142430 -0.414781 -0.106187 -0.082199 0.098577 0.213630 -0.011685 0.002123 -0.103106 -0.111746 0.237974 -0.331116 -0.102580
polarizability: 7.03186053e+02 -4.26401553e+00 6.27165764e+02 -2.89721298e+00 3.68196836e+00 6.21273066e+02
1716.lowfreq: -0.4599 -0.0007 -0.0005 0.0004 1.2441 1.5618 16.1918 29.9765 33.8391
frequency: 16.1912 29.9763 33.8391 50.8780 53.2604 54.9037 56.7035 57.5530 58.8609 62.5507 64.1196 66.1986 68.3328 72.4716 73.4256 74.2761 75.7621 76.1321 77.1183 81.3198 83.4304 86.4006 90.4125 91.2374 97.4507 100.3602 110.1377 118.3130 134.0125 139.2834 140.3244 141.0435 141.6791 142.7366 146.4615 147.9417 148.4748 150.1048 169.7968 170.8967 193.3153 216.9535 225.4138 263.8832 276.6539 301.1887 311.0530 321.0560 326.5838 350.1315 366.4603 368.7164 368.9346 374.9384 379.4908 385.9671 412.2337 420.5189 440.6703 480.8530 513.7384 531.9336 543.4489 548.6601 552.9635 556.0572 572.5521 586.7878 606.1234 621.1157 625.4181 631.2375 643.3749 647.2594 647.9746 680.7753 685.9945 706.3036 712.1375 716.0761 728.0835 741.0245 749.1674 750.5352 770.2764 773.7370 775.5323 819.6812 820.9694 823.4553 839.3741 851.8427 865.5669 878.2313 888.2062 889.8791 891.6894 894.2036 896.1541 900.1539 921.4533 927.4059 930.2852 931.5152 933.5672 938.6251 961.3841 968.5036 971.1642 995.5732 1010.0841 1047.7000 1077.6157 1093.5583 1119.4894 1134.3591 1137.2452 1166.1493 1186.9123 1191.5003 1198.1255 1216.5367 1230.3184 1267.6739 1296.9487 1303.1848 1307.7859 1310.7452 1330.6106 1343.9416 1352.5671 1379.1188 1381.5892 1382.8229 1387.6389 1401.2269 1406.1276 1420.9657 1438.7478 1487.8757 1493.2348 1495.8150 1502.4479 1507.6415 1512.3982 1527.6131 1652.2275 1689.2152 1803.6956 3008.0440 3013.1915 3020.9278 3029.8807 3042.0568 3048.4034 3057.9097 3060.5331 3062.4838 3083.1306 3097.4372 3102.3852 3103.1458 3113.5439 3126.3270 3153.3068 3514.2850 3594.5801 3771.7059
redmass: 7.7369 6.0819 6.9918 11.7424 17.5466 23.5647 24.8730 33.8271 53.5255 29.3861 45.9409 60.1536 52.4290 87.4401 54.4140 68.1830 58.0141 68.7491 60.4847 23.9473 15.3779 17.3119 15.6553 32.9317 14.0514 9.3899 4.7859 7.2085 5.7581 41.4842 68.1078 101.0007 42.9453 36.2322 7.6783 13.7800 40.8711 13.4482 3.5400 2.5735 2.5435 2.5314 1.5311 3.0909 2.4611 2.5340 2.4298 1.8000 4.8541 4.5726 8.5904 9.2662 10.2590 6.2363 1.4434 5.9512 5.0016 3.2970 4.2755 4.1577 2.4221 2.4736 3.3886 9.1788 10.9760 11.0052 8.2711 2.0035 5.5719 6.1371 7.0930 10.4131 3.3266 10.9967 10.9430 5.9613 6.3173 9.6587 10.7822 10.9906 4.5880 8.9397 8.3235 7.7788 5.0949 9.6203 10.8408 10.9849 2.2605 10.8222 4.6876 5.1098 5.3836 3.1456 4.1664 4.7467 9.9355 10.3998 4.3798 10.8704 1.9953 5.2589 9.9057 8.9045 1.5529 2.6231 2.5023 1.4858 1.7830 2.0248 2.9296 2.4918 2.2173 1.9685 2.0870 2.1728 1.9731 2.1115 1.4961 1.6153 1.7203 1.5119 2.4945 1.3333 1.1271 1.5059 1.3460 1.4505 1.3593 1.1993 1.3322 1.3540 1.5601 1.2899 3.3064 1.3517 1.8853 1.2442 1.3744 1.0539 1.0880 1.0514 1.1002 1.0439 1.0512 1.0905 1.0854 11.8823 9.3262 1.0410 1.0429 1.0735 1.0779 1.0618 1.0634 1.0932 1.0857 1.0937 1.0974 1.0953 1.1026 1.0967 1.0967 1.0845 1.0846 1.0545 1.0863 1.0640
irintensity: 0.2779 0.1817 0.9837 0.1736 0.1270 0.2648 0.2479 0.1221 0.0422 0.1160 0.1145 0.0777 0.0284 0.0124 0.0223 0.0456 0.2525 0.0156 0.1032 0.2820 0.6342 0.9431 0.4655 0.6757 1.2422 0.3254 0.5769 2.3696 2.0153 0.0528 0.0221 0.0048 0.0055 0.1380 0.1010 0.2417 0.0174 0.1113 0.3868 0.1212 1.6199 0.2756 0.8847 1.8944 0.2819 6.1276 4.0496 0.2820 0.4549 6.3840 2.0861 0.5538 4.8876 14.5465 24.7903 11.2827 20.9873 2.5784 6.3936 7.8033 10.1678 25.1063 14.7323 1.0830 0.0306 0.0119 0.5586 9.0217 3.1285 9.6167 5.3282 0.6342 86.2696 0.2537 0.3451 5.6875 0.3971 0.1741 0.0423 0.0382 40.3015 3.4541 4.1551 8.3925 11.9727 0.9739 0.1494 0.1225 3.2034 0.3249 4.1265 6.9720 17.6069 10.5693 1.4605 1.7312 4.6106 1.7282 2.8531 11.3992 15.5505 104.5565 150.3865 146.1009 30.5720 3.4188 15.0829 12.2247 28.8438 12.2680 1.2707 61.5371 13.6172 0.5086 88.2019 165.9950 49.1394 25.2240 19.8621 1.9295 6.3196 11.1777 8.7149 8.5815 4.7559 7.1959 14.8192 15.1451 3.6237 2.5443 4.4230 6.2654 9.9107 6.6418 280.4554 35.9547 10.6789 15.9217 14.3460 0.4885 2.9236 1.1642 4.0858 6.2468 5.4908 1.2461 37.6974 161.9146 207.6987 18.0306 95.2290 24.7505 28.0621 48.4542 18.1242 19.2217 1.7674 60.0125 58.2644 18.4228 41.4708 16.8594 11.9470 12.3714 19.1471 36.6205 15.9873 48.0572
temp: 298.150 k
press: 1.00000 atm
elementType: 5 5 5 5 5 5 5 5 5 5 5 5 53 53 53 53 53 53 53 53 53 53 53 6 1 6 1 6 1 6 8 6 1 1 1 7 6 6 1 6 6 1 1 1 1 1 1 6 1 1 1 7 1 1 6 8 8 1
symmnumber: 1
zpe: 963551.9 jmol-1
zpe.correction: 0.366998 hartree
zpe.thermalcorrener: 0.412887 hartree
zpe.thermalcorrenthalpy: 0.413831 hartree
zpe.thermalcorrgfe: 0.279987 hartree
zpe.sumelectzpe: -4340.872891 hartree
zpe.sumelectthermal: -4340.827001 hartree
zpe.sumelectthermalent: -4340.826057 hartree
zpe.sumelectthermalfe: -4340.959902 hartree
dipole: 3.4173 0.4304 -2.6869
dipole: 4.3684
quadrupole: -564.7607 -529.2941 -541.7591
quadrupole: -5.1547 -18.3967 -0.3487
quadrupole: -19.4894 15.9772 3.5123 -5.1547 -18.3967 -0.3487
hfenergy: -4341.2398885 hartree
pointgroup: C01 [X(C11H19B12I11N2O3)]
dipole: 1.3445118 0.1701615 -1.0569295 debye
polarizability: 703.1860238|-4.263331|627.1599073|-2.898519|3.6867413|621.2789526 unknown
InChI: InChI=1/11C.12B.11I.2N.3O.19H
charge -2 multiplicity 1
58 atoms
B  0.33541132 -1.08532143 0.89700691
B  -1.44453913 -1.18842858 0.88659565
B  -2.08376596 0.45168426 0.69542918
B  0.22865283 1.1807482 -0.86532175
B  0.85804306 -0.47012193 -0.67465256
B  -0.59376335 -0.19558942 -1.67292965
B  -2.02014164 -0.64232161 -0.70543455
B  -0.61771651 0.18637205 1.67846482
B  0.88633235 0.65789689 0.74846855
B  -0.70029861 1.58249842 0.5873885
B  -1.5621227 1.06364081 -0.88983993
B  -0.53026911 -1.59388716 -0.57576508
I  -0.71311696 0.37186441 3.85589991
I  1.49876511 -2.53747387 2.02602986
I  -2.51670465 -2.70891657 2.02036815
I  -3.99251957 1.02473346 1.58010927
I  -0.43896544 -3.63806443 -1.33048474
I  -3.82274486 -1.45309469 -1.61958474
I  -0.57677657 -0.44059198 -3.8399234
I  -2.80594075 2.41902658 -2.06372138
I  1.15863334 2.73174181 -2.10849913
I  -1.08675771 3.64550518 1.23966131
I  2.64548312 -1.25107236 -1.67688302
C  1.99003027 2.40525494 2.49565204
H  0.9340432 2.48672308 2.72721246
C  2.19241498 1.11228878 1.64724166
H  2.22183472 0.31264423 2.38745845
C  3.66031317 1.15582572 1.09300428
H  4.17846833 1.8490589 1.76018749
C  4.47831291 -0.09640794 1.43398388
O  4.31663481 -0.62947067 2.52272086
C  2.7088243 2.29452522 3.84384117
H  2.53427452 3.19410908 4.44072553
H  2.34198577 1.4351311 4.40306286
H  3.78884721 2.17579662 3.72888908
N  5.49240855 -0.54236904 0.62929286
C  6.32416004 -1.63473726 1.14289347
C  5.95450057 -0.05308657 -0.6569432
H  6.56696298 -1.45579104 2.18787525
C  7.54244272 -1.63743528 0.22391923
C  6.97833962 -1.11935668 -1.09774033
H  5.15322445 0.01401295 -1.38060401
H  7.99523075 -2.62509776 0.1363686
H  8.29744861 -0.94729936 0.6041833
H  6.43703947 -1.91122668 -1.61747819
H  7.72706419 -0.71725329 -1.77843317
H  5.77040216 -2.57642236 1.09436991
C  2.39394996 3.70602971 1.79487975
H  3.47984385 3.7945712 1.6972584
H  1.94689813 3.796734 0.80730454
H  2.05315408 4.56181955 2.38064175
N  3.89344983 1.70903824 -0.2303954
H  3.36057416 1.21420421 -0.93325499
H  3.55356421 2.65883724 -0.25689016
C  6.59809214 1.31536498 -0.55814924
O  7.06368106 1.82601965 0.42867295
O  6.7096683 1.88663515 -1.78529299
H  7.11120034 2.75320533 -1.64110227
