program: Gaussian 16
title: [B12I11(Leu-Pro)](2-)
version: ES64L-G16RevC.02
frameworkgroup: C1[X(C11H19B12I11N2O3)]
method: RB3LYP
basis: def2TZVPP
operation: Freq
keyword: #P
keyword: Geom=AllCheck
keyword: Guess=TCheck
keyword: SCRF=Check
keyword: GenChk
keyword: RB3LYP/def2TZVPP
keyword: Freq
converged: YES YES YES YES
title: Mulliken charges:
elementType: B B B B B B B B B B B B I I I I I I I I I I I C H C H H C H C O C H H H N C C H C C H H H H H C H H H N H H C O O H
charge: 0.249156 0.002046 0.071340 -0.054637 -0.027906 0.052179 0.247555 -0.521488 -0.107983 0.056239 0.135877 -0.066442 -0.138481 -0.178080 -0.178303 -0.176354 -0.179475 -0.179608 -0.182050 -0.180114 -0.195132 -0.175703 -0.190855 0.108254 -0.006909 -0.104960 0.050116 0.038659 0.192796 0.019099 0.185607 -0.428654 -0.275424 0.056432 0.060435 0.063362 -0.100489 0.142655 0.108040 0.077180 -0.152641 -0.154893 0.110315 0.050764 0.106081 0.066200 0.087063 -0.260031 0.055755 0.123267 0.048011 -0.361529 0.108213 0.114254 0.251386 -0.351030 -0.283769 0.174604
chargesum: -2.00000
title: Mulliken charges with hydrogens summed into heavy atoms:
elementType: B B B B B B B B B B B B I I I I I I I I I I I C C C C O C N C C C C C N C O O
charge: 0.249156 0.002046 0.071340 -0.054637 -0.027906 0.052179 0.247555 -0.521488 -0.107983 0.056239 0.135877 -0.066442 -0.138481 -0.178080 -0.178303 -0.176354 -0.179475 -0.179608 -0.182050 -0.180114 -0.195132 -0.175703 -0.190855 0.101344 -0.016185 0.211896 0.185607 -0.428654 -0.095195 -0.100489 0.219835 0.218355 0.004204 -0.001630 -0.032999 -0.139062 0.251386 -0.351030 -0.109165
polarizability: 7.09401570e+02 6.32360693e+00 6.44906077e+02 3.14888134e+00 6.42470242e-01 6.03020177e+02
1716.lowfreq: -0.0007 -0.0003 0.0001 0.8844 1.1212 1.3096 26.4652 30.3815 38.5648
frequency: 26.4649 30.3813 38.5648 48.7238 51.7804 55.4626 57.5110 58.2455 60.2103 62.0627 63.6974 67.0309 68.4930 71.7846 72.4793 73.1836 73.8171 75.0538 76.6926 78.2596 78.9769 79.4789 87.9348 89.2440 89.8104 94.3606 101.6937 108.8423 114.1023 125.2110 139.9462 140.6761 141.3732 141.5511 142.5126 143.5543 147.4596 148.9159 149.2172 173.1135 192.4786 220.2794 230.5381 252.2334 256.9811 262.3595 283.7819 297.9473 333.4393 355.2537 366.9710 367.4683 368.9807 372.9029 375.0655 380.2503 404.2894 407.5880 417.1378 425.4163 516.3840 520.7826 548.5905 553.5675 554.9914 557.1640 571.2390 586.8423 597.9534 618.4632 634.3944 643.0949 647.8480 650.9708 682.3313 691.8768 697.3108 711.9815 717.6535 721.8919 736.3618 741.4520 751.7115 757.5272 762.1436 773.0550 777.3143 786.2223 820.5891 822.5707 824.7519 839.8137 853.2675 855.7630 871.3804 890.1113 891.8099 893.8954 897.2560 900.3960 902.6806 928.1961 928.9202 929.0491 932.3833 942.2568 960.2779 970.3755 978.2020 987.7841 1015.2702 1046.5238 1079.6805 1082.9707 1094.9720 1122.9453 1132.1220 1153.2033 1168.0720 1189.8095 1194.9030 1200.3057 1218.8647 1267.0929 1293.9815 1296.9913 1305.1255 1310.9301 1334.8868 1341.7174 1355.9406 1364.3516 1365.8131 1388.0501 1394.1819 1400.4774 1404.1510 1425.5537 1447.4989 1477.2320 1488.4035 1493.9944 1502.0193 1503.5330 1509.9172 1510.4967 1631.5359 1667.5424 1797.6601 2987.8801 3004.9377 3015.7014 3029.2182 3053.7278 3059.8753 3063.4183 3065.4746 3068.3191 3072.7088 3108.8472 3110.3441 3123.6754 3129.7808 3131.9795 3166.1057 3507.1931 3603.7403 3764.4359
redmass: 4.6818 5.6038 9.2821 8.9822 6.2439 24.6721 60.4031 43.1907 23.8526 30.8304 13.6035 31.1590 36.4633 22.3996 31.7264 57.8758 45.2397 60.8954 20.2682 39.6136 21.3894 9.8333 36.0296 11.6960 8.3700 25.0685 3.6786 4.5208 5.0877 7.7706 58.4687 52.4304 70.5348 62.4041 106.5486 4.2320 79.8879 92.3133 102.7143 8.9425 3.1684 1.5997 1.0564 3.4331 1.3964 2.4108 3.0047 3.9589 3.2088 4.0520 10.5859 10.2323 9.9822 2.5722 9.1725 6.7368 7.6789 5.9204 2.4021 2.3195 3.1624 4.2267 3.7366 6.9435 10.9827 10.7814 2.0547 2.8289 3.9663 4.1972 8.7629 9.4530 11.0154 10.9914 7.6996 4.0842 5.4271 9.8188 10.8573 9.0615 2.7608 4.1003 9.3518 8.5221 5.0824 10.6442 10.3046 3.6167 3.7535 9.6338 10.9861 3.1023 6.4328 2.1570 2.9155 9.6996 8.9944 10.6990 4.3796 4.8684 8.5159 2.1054 5.7794 2.6037 7.4702 2.8135 1.8523 1.7632 2.2617 3.0845 2.2597 2.5147 1.7975 2.3111 2.9852 2.2383 2.3552 1.8526 1.8259 1.8318 1.7660 1.9123 1.4753 1.3353 1.3494 1.3943 1.4040 1.4291 1.3205 1.4303 1.3833 1.3981 1.3742 1.6124 1.2699 1.2809 1.6846 1.2356 3.4583 1.0833 1.0467 1.0583 1.0854 1.0574 1.0483 1.0948 1.1599 7.3669 8.8468 1.0813 1.0344 1.0407 1.0612 1.0726 1.1012 1.1003 1.0670 1.1008 1.0998 1.0829 1.0849 1.0925 1.0855 1.0959 1.0918 1.0471 1.0955 1.0637
irintensity: 0.0908 0.4873 0.0949 2.0559 2.0445 0.0180 0.0376 0.6170 0.1553 0.0162 0.2190 0.4143 0.3171 0.1894 0.1888 0.0458 0.0615 0.0801 0.3807 0.4851 0.7251 0.1192 0.4883 1.2112 1.1418 0.0177 1.0156 1.5670 0.2353 1.8652 0.0346 0.1041 0.0539 0.0525 0.0225 1.7948 0.0254 0.0277 0.0154 0.9367 2.7992 13.5355 1.8711 2.0588 3.2784 10.6553 1.4013 12.3634 0.2280 2.1313 0.9984 0.8732 7.6136 1.6135 25.9136 17.8151 12.2646 10.0482 3.0293 1.2899 3.0192 2.3109 7.8130 4.0925 0.0010 0.1319 26.0041 17.2216 27.9579 8.4025 6.3816 2.3368 0.0579 0.0527 14.1800 9.6185 3.6281 1.0040 0.3090 4.1623 38.3998 50.2103 0.4254 12.4120 4.6633 2.2835 3.7544 94.4141 4.7879 0.5259 0.0550 3.3253 7.6474 2.5206 7.0805 4.9598 0.4919 0.4982 5.8855 7.7806 10.6869 97.8687 111.2157 68.2257 125.3612 31.1433 4.7768 0.6359 4.1427 1.9014 17.1295 20.1014 3.8221 4.6863 9.0367 237.0647 176.2731 2.5333 14.8900 16.3590 0.8487 9.3219 16.5268 24.1502 3.7933 6.9954 1.6323 5.7259 11.5839 4.2790 10.8069 2.5221 0.9824 78.0290 3.3678 15.8964 49.0181 1.7076 98.6973 2.9412 1.3981 4.5262 1.8674 4.0403 6.7805 6.0986 104.5633 261.1566 176.1882 11.0975 53.8699 56.0263 39.9873 15.8545 8.7428 4.2194 50.5363 65.8902 74.8361 8.0782 7.1154 3.0533 3.6142 4.8237 3.3126 5.6813 2.8740 43.4415
temp: 298.150 k
press: 1.00000 atm
elementType: 5 5 5 5 5 5 5 5 5 5 5 5 53 53 53 53 53 53 53 53 53 53 53 6 1 6 1 1 6 1 6 8 6 1 1 1 7 6 6 1 6 6 1 1 1 1 1 6 1 1 1 7 1 1 6 8 8 1
symmnumber: 1
zpe: 960590.4 jmol-1
zpe.correction: 0.365870 hartree
zpe.thermalcorrener: 0.412180 hartree
zpe.thermalcorrenthalpy: 0.413124 hartree
zpe.thermalcorrgfe: 0.278424 hartree
zpe.sumelectzpe: -4340.897996 hartree
zpe.sumelectthermal: -4340.851686 hartree
zpe.sumelectthermalent: -4340.850742 hartree
zpe.sumelectthermalfe: -4340.985442 hartree
dipole: -0.4331 -0.6611 1.1214
dipole: 1.3719
quadrupole: -581.6103 -533.6769 -533.2864
quadrupole: 8.1909 -5.1270 -1.0467
quadrupole: -32.0858 15.8476 16.2381 8.1909 -5.1270 -1.0467
hfenergy: -4341.2638659 hartree
pointgroup: C01 [X(C11H19B12I11N2O3)]
dipole: 0.1718417 -0.2582636 -0.4416922 debye
polarizability: 709.4628583|-5.999823|644.8455378|3.1686829|-0.5384343|603.0194278 unknown
InChI: InChI=1/11C.12B.11I.2N.3O.19H
charge -2 multiplicity 1
58 atoms
B  0.57131859 -1.02698316 -0.75036011
B  -0.45091172 -1.59884318 0.58516947
B  -0.78164978 -0.20747803 1.64154535
B  -0.6826511 1.55572512 -0.63101844
B  -0.33599996 0.17187488 -1.68195279
B  -1.94862978 0.33081091 -0.92919046
B  -2.01196814 -0.75676219 0.47871905
B  0.82283704 -0.37603559 0.87901176
B  0.9517759 0.73529534 -0.53594845
B  0.04945545 1.22131477 0.94726527
B  -1.71053216 0.98099459 0.7090759
B  -1.17265956 -1.26028863 -1.00465316
I  2.51155483 -0.88167273 2.16850577
I  1.93794221 -2.41621925 -1.75245673
I  -0.29696544 -3.62694636 1.36493406
I  -1.07695887 -0.449325 3.78677655
I  -1.95972105 -2.8504096 -2.27004513
I  -3.86600009 -1.69826565 1.12285439
I  -3.73641085 0.76249181 -2.09837342
I  -3.19484684 2.25613135 1.66898955
I  -1.09049124 3.57800651 -1.38726283
I  0.75946176 2.79744617 2.2820951
I  -0.08033753 0.3729117 -3.84498218
C  6.17573984 -2.57473376 -0.22055668
H  6.04163172 -2.66175341 -1.30471938
C  5.97879762 -1.10684503 0.17390001
H  5.83060364 -1.04039945 1.25370721
H  6.8853419 -0.53510276 -0.03833198
C  4.81493139 -0.4052233 -0.53327241
H  3.90852316 -0.98681927 -0.4037245
C  4.59712676 0.98245019 0.06787555
O  5.47640499 1.51081171 0.74974079
C  7.60189205 -3.02809515 0.10063133
H  7.75664387 -4.0764077 -0.16757724
H  8.34023921 -2.42639062 -0.43403969
H  7.80364674 -2.9257724 1.17060843
N  3.47835081 1.67606105 -0.25397862
C  3.56867395 3.12457199 -0.06819207
C  2.36616326 1.28850154 -1.16859263
H  3.39814299 3.40106044 0.96817767
C  2.49138212 3.68692865 -1.00898216
C  2.27357829 2.56363178 -2.01827736
H  2.73908819 0.48486048 -1.79669875
H  2.7975212 4.62409048 -1.47330326
H  1.58745 3.87931803 -0.44011417
H  3.0905219 2.54782537 -2.74090533
H  1.34112981 2.66297747 -2.55823658
C  5.15949632 -3.49176916 0.46028486
H  5.29602753 -3.46957529 1.54436992
H  4.13443471 -3.19154629 0.25632145
H  5.27808486 -4.52574051 0.12654112
N  4.99223445 -0.22228611 -1.97544031
H  5.88995459 0.19257079 -2.18803177
H  4.890976 -1.09587791 -2.47205445
C  4.9210197 3.66911903 -0.49311785
O  5.52594391 3.40725271 -1.50252069
O  5.33727943 4.65815489 0.34298945
H  6.16580944 4.98082074 -0.03527644
