program: Gaussian 16
title: [B12I11(Leu-Pro)](2-)
version: ES64L-G16RevC.02
frameworkgroup: C1[X(C11H19B12I11N2O3)]
method: RB3LYP
basis: def2TZVPP
operation: Freq
keyword: #P
keyword: Geom=AllCheck
keyword: Guess=TCheck
keyword: SCRF=Check
keyword: GenChk
keyword: RB3LYP/def2TZVPP
keyword: Freq
converged: YES YES YES YES
title: Mulliken charges:
elementType: B B B B B B B B B B B B I I I I I I I I I I I C H C H H C H C O C H H H N C C H C C H H H H H H C H H H N H H C O O
charge: 0.025092 0.028546 0.026972 0.084335 -0.106227 0.032135 0.035002 0.054680 0.192274 0.026985 0.049486 -0.048523 -0.168996 -0.132878 -0.176828 -0.181586 -0.178281 -0.179019 -0.182562 -0.182512 -0.195266 -0.183346 -0.149350 0.103476 0.010478 -0.110469 0.054010 0.028755 0.129836 0.104771 0.135776 -0.422787 -0.275572 0.068045 0.056974 0.058507 -0.089309 -0.054874 0.189388 0.072576 -0.129923 -0.134983 0.125400 0.046987 0.087370 0.053520 0.102284 0.053976 -0.236673 0.048511 0.091584 0.068260 -0.361151 0.093875 0.144191 0.097618 -0.315276 -0.385284
chargesum: -2.00000
title: Mulliken charges with hydrogens summed into heavy atoms:
elementType: B B B B B B B B B B B B I I I I I I I I I I I C C C C O C N C C C C C N C O O
charge: 0.025092 0.028546 0.026972 0.084335 -0.106227 0.032135 0.035002 0.054680 0.192274 0.026985 0.049486 -0.048523 -0.168996 -0.132878 -0.176828 -0.181586 -0.178281 -0.179019 -0.182562 -0.182512 -0.195266 -0.183346 -0.149350 0.113954 -0.027704 0.234607 0.135776 -0.422787 -0.092046 -0.089309 0.071679 0.314787 0.004434 0.020820 -0.028317 -0.123085 0.097618 -0.315276 -0.385284
polarizability: 7.15470636e+02 6.25566312e+00 6.50299504e+02 3.37843245e+00 5.46200932e-01 6.05011949e+02
1716.lowfreq: -0.0018 -0.0007 -0.0003 0.9208 1.5508 1.7356 13.6651 20.4542 23.5977
frequency: 13.6644 20.4531 23.5976 39.5923 41.9962 52.0899 54.0570 56.1881 57.2726 58.8466 60.1210 60.9013 64.0823 66.3864 67.8763 68.9938 70.3511 71.5893 72.1854 72.5424 73.3755 74.8036 77.8318 79.0120 82.5539 83.0682 88.9495 93.6575 112.9806 123.4478 138.4499 141.3645 141.8427 142.1254 143.0043 143.1872 145.2594 148.5653 150.1643 150.4673 163.3435 191.8297 220.4286 224.5690 234.8713 253.0584 264.4636 294.5789 313.6486 323.7548 358.2838 363.4152 366.0694 371.9710 372.4802 380.4098 397.5903 408.2077 414.6345 424.2266 486.7629 534.3381 554.2154 558.2526 564.9195 566.6364 568.6683 578.2794 603.6142 643.2670 646.8103 648.8570 651.1568 670.5632 684.9605 711.5349 716.5069 718.8627 721.2617 723.3980 754.7305 764.3014 765.1928 769.9881 771.9993 776.6121 822.0579 833.1388 837.1373 844.2203 852.0443 860.0802 865.5380 886.3340 894.3640 897.4642 899.2340 900.5517 905.4192 911.2655 920.1537 923.8053 932.2598 935.0764 939.6550 943.6501 951.7256 969.7502 974.4186 997.4032 1040.2998 1065.6867 1096.4119 1112.2946 1120.9841 1151.5313 1157.1620 1186.4761 1193.7682 1206.2244 1212.8396 1228.1676 1266.5167 1274.4598 1279.7471 1300.4856 1305.8742 1331.8011 1352.1892 1353.3560 1366.7162 1379.3111 1389.3553 1397.1173 1400.4870 1406.9598 1428.4777 1447.4813 1480.5091 1488.5039 1495.1111 1497.3065 1503.8461 1506.9854 1509.7440 1525.0767 1648.6708 1686.8423 1792.7975 2998.4976 3003.5076 3005.6975 3013.2021 3019.4251 3041.0400 3054.3204 3059.4369 3064.4520 3070.8604 3075.9590 3079.5488 3081.2295 3097.7573 3119.8864 3125.2519 3133.5869 3489.4198 3579.6848
redmass: 4.4281 8.7711 7.9799 14.0976 4.2903 38.3543 35.0635 16.6686 50.1137 43.5623 10.8023 23.7963 9.0685 33.5425 14.5523 17.8232 54.1171 20.7735 41.2832 16.9107 13.4512 36.7168 9.6834 11.2572 20.6517 28.0355 13.7471 4.2610 4.5239 4.0426 7.9654 55.3270 68.4563 34.3029 8.5384 46.1253 6.9171 24.6244 85.0631 98.5216 8.1458 6.1251 2.1744 1.1356 2.3152 1.2462 1.4529 3.0082 4.3264 3.8697 3.1770 11.1763 6.3615 12.0517 11.0670 3.1357 11.3093 10.8671 2.3104 2.3693 3.3754 6.8136 11.0165 10.8148 10.0370 10.8093 7.8972 2.6841 2.7259 10.8783 11.1259 11.1283 11.0803 6.2485 5.8959 8.0956 10.8691 10.9656 10.1269 10.9192 5.4726 9.9035 10.9434 8.2985 10.9700 2.7674 2.2967 10.6251 10.9745 3.3551 2.8621 2.0219 3.8885 2.1089 3.1969 9.5481 10.2839 10.9625 10.4923 10.8185 2.8037 5.0607 1.2950 3.3488 10.9561 6.3958 1.8833 1.6037 1.8652 2.0324 2.1972 1.7962 2.9563 1.5936 1.9737 4.2138 2.0657 1.3452 1.7722 1.4747 1.7845 2.8040 1.3747 1.6848 2.4826 1.4165 1.4526 1.3438 1.3537 1.3467 1.3910 1.5869 1.5331 1.2665 1.6480 1.2993 1.2310 4.9496 1.0799 1.0493 1.0605 1.0929 1.0584 1.0940 1.0483 1.0944 1.1110 9.6208 12.1250 1.0734 1.0753 1.0398 1.0616 1.0500 1.0696 1.0598 1.0941 1.0962 1.0998 1.0883 1.0970 1.0898 1.1038 1.0985 1.0960 1.0856 1.0491 1.0945
irintensity: 0.1897 0.1518 0.2076 0.1002 0.6575 0.0368 0.0633 0.2451 0.0214 0.0479 0.4495 0.0433 0.0231 0.0218 0.0142 0.0866 0.0509 0.0166 0.0536 0.0550 0.0714 0.0207 0.1668 0.0494 0.2586 1.0012 2.0279 1.0908 1.5608 1.9512 0.9321 0.1644 0.0161 0.1067 0.4591 0.1314 1.4092 0.0780 0.0852 0.0078 4.1008 1.5640 0.7494 0.0080 6.5654 9.1931 17.0129 2.3010 19.6433 18.9472 1.1244 0.0512 5.4204 10.7922 6.6527 3.1109 9.1169 11.0523 2.8941 2.5743 4.9446 3.9581 0.0860 0.1011 1.6118 0.2590 2.2458 6.6206 4.2755 0.5016 0.4930 0.3377 0.1211 14.8207 2.5684 6.3050 0.8434 2.5464 2.2239 0.4051 15.9014 2.6337 1.3323 8.3619 0.3138 22.0670 72.7214 1.5798 0.2142 11.5751 10.3387 8.9062 22.9185 4.8071 1.4516 4.9579 11.5923 0.7866 0.0454 11.0230 33.4960 87.5105 2.1872 44.5016 141.1550 94.5136 4.9909 0.6890 0.9859 15.4395 7.6887 0.2183 5.8886 7.1519 2.2739 1.2776 9.4734 4.2533 0.9998 14.4769 1.6118 38.8780 93.7325 192.6781 581.7655 34.9528 16.4599 4.1681 12.4150 9.6717 1.1921 49.6591 36.1198 1.7821 74.8768 4.7388 3.6691 153.0584 2.9367 2.9560 7.5439 3.1563 8.2007 1.5660 14.3711 3.3021 51.7894 391.1182 166.4232 76.9061 4.5298 38.4221 43.8418 61.8013 26.6251 34.0224 2.8929 35.6174 29.7917 19.6976 54.9418 38.2008 40.7965 3.3728 8.5487 8.5705 61.8870 38.0532
temp: 298.150 k
press: 1.00000 atm
elementType: 5 5 5 5 5 5 5 5 5 5 5 5 53 53 53 53 53 53 53 53 53 53 53 6 1 6 1 1 6 1 6 8 6 1 1 1 7 6 6 1 6 6 1 1 1 1 1 1 6 1 1 1 7 1 1 6 8 8
symmnumber: 1
zpe: 958935.6 jmol-1
zpe.correction: 0.365239 hartree
zpe.thermalcorrener: 0.412107 hartree
zpe.thermalcorrenthalpy: 0.413052 hartree
zpe.thermalcorrgfe: 0.274134 hartree
zpe.sumelectzpe: -4340.931626 hartree
zpe.sumelectthermal: -4340.884758 hartree
zpe.sumelectthermalent: -4340.883814 hartree
zpe.sumelectthermalfe: -4341.022732 hartree
dipole: 0.0523 0.1602 2.0423
dipole: 2.0492
quadrupole: -610.8757 -526.9820 -531.9439
quadrupole: 4.5275 -12.5205 0.7217
quadrupole: -54.2752 29.6185 24.6566 4.5275 -12.5205 0.7217
hfenergy: -4341.2968651 hartree
pointgroup: C01 [X(C11H19B12I11N2O3)]
dipole: 0.0274029 0.0523331 0.8040626 debye
polarizability: 715.5918166|5.8280382|650.2051593|2.5697325|1.0728192|604.9851128 unknown
InChI: InChI=1/11C.12B.11I.2N.3O.19H
charge -2 multiplicity 1
58 atoms
B  -0.39967414 -0.60528895 -1.13464392
B  1.33008969 -0.41837424 -1.52405521
B  1.96653124 0.96472196 -0.59836009
B  0.12223159 0.38421354 1.52489926
B  -0.51436752 -0.98957533 0.59923269
B  1.12698334 -1.05510437 1.28331063
B  2.27415042 -0.69942716 -0.03422018
B  0.31277894 1.02438325 -1.27822538
B  -0.83798456 0.67287291 0.03637154
B  0.63629831 1.62772208 0.36556627
B  1.841725 0.57218517 1.13651224
B  0.81281071 -1.66790206 -0.36003016
I  -0.21467902 2.37335786 -2.90102627
I  -1.79927521 -1.41214789 -2.59077035
I  2.12024252 -0.93712397 -3.48463979
I  3.56105202 2.23086789 -1.3674418
I  0.92560462 -3.79360074 -0.81567361
I  4.26456114 -1.57727874 -0.08327905
I  1.62203239 -2.38679229 2.93200399
I  3.26119155 1.33953604 2.59670133
I  -0.73580058 0.92766348 3.45324376
I  0.44272871 3.74888851 0.83186672
I  -2.17370164 -2.19121311 1.35733364
C  -6.21844304 -2.68716008 0.11714864
H  -5.6605797 -2.76823262 1.05553626
C  -6.79783346 -1.27161745 0.02026023
H  -7.14394953 -1.0900639 -0.999184
H  -7.68624514 -1.18078432 0.65289257
C  -5.82446393 -0.1644335 0.42864378
H  -4.88837987 -0.29820609 -0.11459255
C  -6.38632187 1.21297882 0.02925923
O  -7.54920678 1.36067004 -0.34244709
C  -7.3425664 -3.72422372 0.155016
H  -6.94190633 -4.7382938 0.21912905
H  -8.0039038 -3.56511141 1.01008396
H  -7.95202992 -3.66430697 -0.75133631
N  -5.53590363 2.26168493 0.0963112
C  -5.95457113 3.58756931 -0.35676681
C  -4.16763537 2.24394949 0.59689044
H  -6.42343128 3.51611691 -1.33704997
C  -4.6547213 4.39272172 -0.35281739
C  -3.83482237 3.73723164 0.76120884
H  -4.11140096 1.71271187 1.54091442
H  -4.82510741 5.45639539 -0.1877067
H  -4.13994208 4.27225859 -1.30605351
H  -4.18117708 4.06989584 1.74149954
H  -2.76593234 3.92627059 0.69931671
H  -6.69741794 4.0042507 0.33149623
C  -5.25528334 -2.97960708 -1.03195346
H  -5.78626433 -2.9515436 -1.9878801
H  -4.4395778 -2.26216888 -1.08258563
H  -4.80023273 -3.96555974 -0.92521263
N  -5.49585937 -0.16252312 1.85993395
H  -6.27736733 -0.49612788 2.40810903
H  -4.69044481 -0.74577339 2.05130328
C  -3.1816905 1.59033496 -0.37002214
O  -3.37880289 1.42262717 -1.5429039
O  -2.09129173 1.27604879 0.31543456
