program: Gaussian 09
title: 000050465
version: EM64L-G09RevD.01
frameworkgroup: C1[X(C7H5Cl2FN2O3)]
method: RPBEPBE
basis: SDD
operation: Freq
keyword: #p
keyword: freq=noraman
keyword: PBEPBE/SDD
title: #p freq=noraman PBEPBE/SDD
converged: NO YES NO NO
title: Mulliken charges:
elementType: Cl Cl F O O O N N C C C C C C C H H H H H
charge: -0.005020 -0.013912 -0.163735 -0.227034 -0.419684 -0.191058 -0.041412 -0.654080 0.733086 0.290783 -0.448812 -0.452355 0.141710 -0.309090 0.162721 0.271568 0.271547 0.332087 0.332844 0.389847
chargesum: 0.00000
title: Mulliken charges with hydrogens summed into heavy atoms:
elementType: Cl Cl F O O O N N C C C C C C C
charge: -0.005020 -0.013912 -0.163735 -0.227034 -0.029837 -0.191058 -0.041412 0.010851 0.733086 0.290783 -0.448812 -0.452355 0.141710 0.234024 0.162721
polarizability: 1.79739624e+02 -1.63764226e+00 1.39768054e+02 2.03601243e-02 1.02900764e-01 5.02904991e+01
1716.lowfreq: -5.5737 -2.5134 0.0015 0.0019 0.0023 5.1154 11.9583 35.8330 69.2055
frequency: 11.8777 35.8128 69.2032 83.5034 101.9034 123.6547 176.2050 194.8891 206.1116 217.5990 278.8931 295.7388 309.2350 344.8863 355.0273 418.7439 447.6385 499.5344 515.8227 530.6450 552.5048 562.6254 623.2275 624.3562 625.6468 639.5043 645.0690 719.6221 725.1769 878.0058 952.0852 987.4316 1003.3402 1035.3580 1054.3303 1085.7247 1126.5435 1196.2993 1252.5124 1329.5298 1358.3505 1366.4561 1433.7306 1452.9649 1488.7245 1535.1237 1588.7652 1633.4660 1702.5177 3013.0755 3071.0731 3527.3617 3532.3386 3677.1450
redmass: 12.8755 8.2158 10.9741 7.4008 9.1509 3.0643 17.1641 11.5789 7.6288 13.8192 14.7206 10.3769 4.3145 7.6915 15.2814 11.7067 6.1794 1.7886 1.0690 1.2082 5.5135 11.3107 8.2999 6.9782 1.6427 10.4821 4.7594 10.9459 12.1818 4.3083 8.3793 2.0059 10.9785 4.1936 2.8666 2.5246 4.0529 1.0754 1.6021 8.7957 3.7878 2.7923 2.1327 1.7468 5.6432 7.6596 2.7238 1.8627 9.3288 1.0574 1.1035 1.0643 1.0450 1.1046
irintensity: 1.0715 1.7590 3.4177 0.9556 0.3478 12.3119 1.0680 0.4993 0.0254 0.6486 0.1970 3.5123 4.9120 0.0122 4.8135 6.8988 14.6161 30.8812 11.6614 271.7259 38.7055 3.1488 5.1364 13.9348 134.4379 0.6113 11.0931 68.5446 22.5243 4.4435 65.3882 0.5099 130.2066 379.1254 51.6509 49.4527 95.8692 0.6903 62.1467 110.4289 183.0732 121.7779 207.8621 28.1304 0.9697 61.6157 86.0458 506.3240 198.5890 24.3121 5.1702 40.0324 97.1726 57.7181
temp: 298.150 k
press: 1.00000 atm
elementType: 17 17 9 8 8 8 7 7 6 6 6 6 6 6 6 1 1 1 1 1
symmnumber: 1
zpe: 318307.8 jmol-1
zpe.correction: 0.121237 hartree
zpe.thermalcorrener: 0.135961 hartree
zpe.thermalcorrenthalpy: 0.136905 hartree
zpe.thermalcorrgfe: 0.076596 hartree
zpe.sumelectzpe: -1623.774660 hartree
zpe.sumelectthermal: -1623.759936 hartree
zpe.sumelectthermalent: -1623.758992 hartree
zpe.sumelectthermalfe: -1623.819301 hartree
dipole: 1.1067 1.4011 -0.0216
dipole: 1.7856
quadrupole: -81.6970 -103.5883 -98.2503
quadrupole: 21.5658 0.0773 -0.0921
quadrupole: 12.8149 -9.0764 -3.7385 21.5658 0.0773 -0.0921
hfenergy: -1623.8958966 hartree
pointgroup: C01 [X(C7H5Cl2F1N2O3)]
dipole: 0.4564864 -0.533925 0.0094221 debye
dipolederiv: -0.1235777 -0.1185842 0.0004835 -0.1990194 -0.6554877 0.0023696 0.0007925 0.0024161 -0.0057977 -0.7710938 -0.191123 0.0007835 -0.1246636 -0.1311506 0.0004583 0.0004305 0.0004222 -0.0054997 -0.2760072 -0.1982637 0.0007186 -0.2590805 -1.0493297 0.0031881 0.0009306 0.0030313 -0.1571098 -1.9380664 0.2553398 -0.0004279 0.0851605 -0.2810738 0.0006377 -0.0008496 0.0001846 -0.2707759 -0.9579044 0.5675221 0.0095626 0.542576 -0.7936785 -0.0069309 0.0104532 -0.006956 -0.4377866 -0.7231309 -0.1968292 -0.0018479 0.0286719 -0.8837486 -0.0089944 0.002072 -0.0079481 -0.2921497 -1.1727013 -0.1381172 0.0006708 -0.3175234 -0.7370337 0.0020323 0.0007494 0.0019294 -0.1900178 -0.8502818 0.5725487 -0.0018726 0.6562651 -0.792759 0.0004578 -0.0022801 0.0005288 -0.6389244 0.830282 -0.6837532 0.0022141 -0.6708742 0.6843261 -0.0016582 0.0022468 -0.0016263 0.1809195 2.0670869 -0.2569505 0.0004785 0.2814245 0.4164634 -0.0010377 -0.0004336 -0.0010235 0.1988105 -0.6645062 0.5433284 -0.0017529 0.47948 0.7394362 -0.0033037 -0.0013812 -0.0032345 -0.1507945 0.8088391 0.3849745 -0.0014421 0.4126783 -0.4075915 0.0008894 -0.0013893 0.0008856 -0.1503016 0.8437001 0.1517882 -0.0005894 0.1186685 1.405949 -0.0041725 -0.000552 -0.0040115 0.2189735 0.5530437 -0.2660717 0.0017281 -0.7803692 0.2422988 -0.0011596 0.0048324 -0.0009377 0.33701 1.612889 -0.2192135 -0.0078276 -0.2628814 1.4400362 0.0188279 -0.0116016 0.0177955 0.2090801 0.0241665 0.0011487 -0.0139864 0.1381483 0.0365115 -0.0535433 -0.0005473 -0.0669332 0.0017298 0.0245339 0.0006524 0.0139093 0.1385697 0.0370552 0.0530976 -0.0020059 0.0668254 0.0011717 0.2691801 -0.0596295 0.0002079 -0.039867 0.2298416 0.0004999 0.0001378 0.0004787 0.3736473 0.2286405 -0.0438961 0.0001272 -0.07264 0.2605304 0.00039 0.0002678 0.0003699 0.3727028 0.2149078 -0.1048708 -0.001137 -0.1547243 0.2394045 -0.0020483 -0.0018724 -0.0021967 0.4051124 unknown
polarizability: 179.5523949|3.1824138|139.9552507|-0.0915772|-0.0920403|50.2905318 unknown
InChI: InChI=1S/C7H5Cl2FN2O3/c8-3-5(11)4(9)7(12-6(3)10)15-1-2(13)14/h13H,1,11H2
charge 0 multiplicity 1
20 atoms
Cl 0.254483 -2.941664 0.009477
Cl 4.313803 0.910677 -0.004219
F  1.888989 2.773835 -0.010331
O  -1.488526 -0.473817 0.000767
O  -4.712122 1.195441 0.017827
O  -4.192047 -1.077276 -0.015813
N  0.236822 1.145787 -0.00467
N  3.135228 -1.920799 0.005544
C  2.190468 -0.926654 0.002207
C  -0.14304 -0.15837 -0.00018
C  0.792418 -1.212547 0.003343
C  2.557761 0.459331 -0.002559
C  1.545457 1.421276 -0.005711
C  -2.409935 0.666276 -0.000668
C  -3.82389 0.108612 -0.000957
H  -2.252749 1.305076 0.887383
H  -2.252611 1.302036 -0.89116
H  4.125102 -1.683351 0.004616
H  2.84327 -2.896286 0.008897
H  -5.649083 0.860218 0.014805
