program: Gaussian 16
title: FHZM062xAugccpVDZopt
version: ES64L-G16RevA.03
method: RM062X
basis: def2SVP
operation: Freq
keyword: #NGeom=AllCheck
keyword: Guess=TCheck
keyword: SCRF=Check
keyword: GenChk
keyword: RM062X/def2SVP
keyword: Freq
converged: YES YES NO YES
title: Mulliken charges:
elementType: C C C C O H H C H H H C O N H N H H
charge: 0.118924 -0.069854 -0.111061 -0.037393 -0.262149 0.064093 0.041367 0.025360 0.072617 0.086609 0.063753 0.222113 -0.320328 -0.225399 0.171390 -0.139342 0.149814 0.149486
chargesum: -0.00000
title: Mulliken charges with hydrogens summed into heavy atoms:
elementType: C C C C O C C O N N
charge: 0.183018 -0.028487 -0.111061 -0.037393 -0.262149 0.248338 0.222113 -0.320328 -0.054009 0.159958
1716.lowfreq: -10.0795 -0.0016 -0.0011 -0.0010 3.7680 19.6356 55.2325 112.7683 123.3604
frequency: 53.1927 112.6631 123.2891 168.3656 200.6494 243.4696 257.9849 321.5046 346.1797 402.3444 508.5891 552.2401 635.1536 668.3179 692.7830 776.8974 811.2870 835.2829 915.6028 920.4214 962.7805 976.2226 1040.9711 1049.6487 1112.7347 1150.4908 1200.7063 1280.8361 1311.1327 1334.2372 1343.4742 1390.4974 1442.2986 1448.1815 1487.3050 1568.2788 1594.2084 1669.5231 1684.0116 1825.8922 3069.3470 3155.2098 3195.9769 3293.2998 3317.6817 3519.2410 3600.5023 3602.2380
redmass: 3.1154 2.0291 2.9081 2.3336 1.4875 2.5006 2.6349 4.3695 3.8412 5.5122 4.5800 1.1991 3.4328 3.8151 4.3703 1.5409 3.7409 2.2626 2.7123 1.7859 1.8833 1.7258 1.7775 1.5493 3.3285 2.1965 3.3823 2.4410 3.6914 1.1925 1.8478 1.4496 1.0654 1.1148 3.4427 2.1160 4.9375 1.4305 4.4138 10.0868 1.0404 1.1007 1.1045 1.0931 1.1098 1.0500 1.0793 1.0969
irintensity: 17.3713 2.9162 0.9081 7.2133 109.1704 4.4055 14.4515 1.3764 14.1108 1.0108 9.1765 103.8200 7.1819 5.6750 9.6861 74.7828 4.3930 142.9930 19.1918 15.7683 44.3666 70.5639 3.0058 6.3506 93.3056 46.2305 20.1503 7.4331 88.7614 2.9069 25.1892 2.3359 15.0354 27.4185 18.7149 159.8617 59.7744 50.6498 79.8696 676.9062 12.1845 3.4964 1.7192 4.7111 0.8399 10.1583 61.2058 23.0775
temp: 298.150 k
press: 1.00000 atm
elementType: 6 6 6 6 8 1 1 6 1 1 1 6 8 7 1 7 1 1
symmnumber: 1
zpe: 377859.3 jmol-1
zpe.correction: 0.143919 hartree
zpe.thermalcorrener: 0.153596 hartree
zpe.thermalcorrenthalpy: 0.154540 hartree
zpe.thermalcorrgfe: 0.108659 hartree
zpe.sumelectzpe: -492.665032 hartree
zpe.sumelectthermal: -492.655355 hartree
zpe.sumelectthermalent: -492.654411 hartree
zpe.sumelectthermalfe: -492.700292 hartree
dipole: 0.5327 5.9104 -2.9802
dipole: 6.6407
quadrupole: -51.8836 -55.1995 -58.2078
quadrupole: -14.5548 6.2884 2.8034
quadrupole: 3.2133 -0.1026 -3.1108 -14.5548 6.2884 2.8034
hfenergy: -492.8089513 hartree
pointgroup: C01 [X(C6H8N2O2)]
dipole: 0.2095634 2.3253476 -1.1725054 debye
dipolederiv: 0.1174599 0.17176 -0.0034708 0.1395875 0.3640672 0.0455335 -0.0168503 0.0272166 -0.0723221 -0.0349317 -0.0169478 -0.0282051 -0.1162073 -0.0133286 0.0277201 0.0237352 0.0489111 -0.1922495 -0.6375974 -0.3007219 0.0192436 -0.2030827 -0.2566825 0.02969 0.0162664 0.0150997 -0.1747975 0.7900959 0.1818015 -0.0439531 0.2588639 0.6473532 0.0718734 -0.120918 0.0185121 0.0797392 -1.072202 -0.1902207 0.0668747 -0.2080453 -0.7614361 -0.0628587 0.0880404 -0.0475213 -0.2006679 0.0517872 0.024681 0.0172143 -0.0074028 0.1023523 -0.0123159 0.0070551 -0.0180939 0.2017239 0.1581437 -0.0000219 0.0030592 0.0095248 0.0353335 -0.0203205 -0.0058655 -0.0118234 0.1806833 -0.0367892 -0.0555745 -0.0080854 0.0395751 -0.1086102 -0.0394981 0.0184689 0.0374102 0.0419268 0.0168088 -0.0437844 -0.0832369 -0.00514 0.0051147 -0.0327271 -0.0666492 -0.0794147 0.0611549 0.1226966 0.0379411 0.0089159 0.0133836 -0.0652377 0.0261742 -0.0024841 0.0641848 -0.0299162 -0.0072908 0.0446067 0.063988 -0.005558 0.064274 0.0141955 0.0639492 -0.0041006 0.0898458 2.0265578 0.1031919 0.0453077 -0.1621197 2.1045092 -0.716362 0.1337575 -0.7328306 0.7106856 -1.0070716 -0.4215851 0.1520048 -0.1796 -1.5238117 0.416091 0.0246312 0.445477 -0.6806477 -0.5239524 0.4349143 -0.2740019 0.2608906 -0.9722884 0.1140263 -0.1069602 0.0041053 -0.4960366 0.050113 0.0118799 0.0394791 -0.0349837 0.2968495 0.0397185 0.0697028 0.0989686 0.3164541 -0.2283283 -0.0698348 0.0790934 0.0168839 -0.3905484 0.1787501 -0.0030391 0.2117892 -0.2397389 0.1121997 0.009419 -0.0675199 0.0701506 0.1704695 -0.1047667 -0.0880481 -0.0330538 0.2805224 0.1023008 0.0784957 0.0132925 0.1132795 0.3016204 0.0250762 -0.034792 -0.0448362 0.1236404 unknown
polarizability: 118.4400011|-2.9150061|113.7229445|-1.9948147|-1.1561692|60.8760221 unknown
InChI: InChI=1/6C.2N.2O.8H
charge 0 multiplicity 1
18 atoms
C  2.54761481 -0.86272735 -0.24759768
C  1.33138073 -1.45929874 -0.18644982
C  0.38218837 -0.39642256 0.00744976
C  1.10986607 0.76585878 0.06957358
O  2.41756236 0.47675171 -0.08819471
H  3.55755678 -1.23415191 -0.39001704
H  1.10654739 -2.5182121 -0.27359045
C  0.77049701 2.19718058 0.29837648
H  1.52256251 2.65518589 0.95407878
H  0.75907206 2.76173506 -0.64642374
H  -0.21352594 2.28757596 0.7720704
C  -1.08146104 -0.61985817 0.16577991
O  -1.51925234 -1.6565435 0.6285882
N  -1.85568475 0.4191137 -0.25841432
H  -1.41663718 1.15467207 -0.80483933
N  -3.2384185 0.36477064 -0.17032675
H  -3.58136823 1.21381845 0.27561037
H  -3.64483211 0.32138549 -1.10430866
