program: Gaussian 16
title: furanM062xTS
version: ES64L-G16RevA.03
method: UM062X
basis: def2SVP
operation: Freq
keyword: #N
keyword: Geom=AllCheck
keyword: Guess=TCheck
keyword: SCRF=Check
keyword: GenChk
keyword: UM062X/def2SVP
keyword: Freq
converged: YES YES YES YES
elementType: C
elementType: O
elementType: H
1716.lowfreq: -661.4364 -0.0008 -0.0003 0.0007 12.2568 14.4448 28.2188 67.0995 118.2646
frequency: -661.4361 66.6376 118.2539 177.8068 216.8449 253.9422 284.0356 410.1366 509.9582 558.6490 603.5873 608.6600 771.9942 812.7398 815.2717 887.3807 900.4931 945.1536 962.3795 1024.8840 1078.6648 1193.5919 1264.5179 1285.5245 1327.4621 1446.2674 1479.9864 1506.5731 1558.5914 1823.2429 3288.5566 3306.6661 3312.0704
redmass: 13.1896 13.4979 14.4304 10.8011 7.4845 6.5565 5.0720 10.7308 7.0867 6.3123 11.2082 5.1826 3.1911 11.6405 1.6605 2.4625 1.7288 3.6566 1.3669 1.1756 1.6825 1.8964 3.5502 5.9592 11.0149 9.4317 4.0070 4.9826 5.8191 12.9137 1.0936 1.0997 1.1087
irintensity: 714.9941 0.5242 4.0177 2.5871 5.4870 2.0978 9.9765 6.6531 5.8331 8.8474 10.3712 27.9500 156.1943 149.2245 14.9807 76.9937 22.4689 26.5461 14.6494 56.9483 42.5168 137.3705 135.7156 377.5694 121.0007 395.5712 138.3594 3.9193 12.1359 782.8904 0.4415 3.0458 1.7514
temp: 298.150 k
press: 1.00000 atm
elementType: 6 6 6 8 1 1 8 8 6 1 6 8 8
symmnumber: 1
zpe: 208153.4 jmol-1
zpe.correction: 0.079281 hartree
zpe.thermalcorrener: 0.087250 hartree
zpe.thermalcorrenthalpy: 0.088194 hartree
zpe.thermalcorrgfe: 0.045844 hartree
zpe.sumelectzpe: -567.680625 hartree
zpe.sumelectthermal: -567.672657 hartree
zpe.sumelectthermalent: -567.671713 hartree
zpe.sumelectthermalfe: -567.714062 hartree
dipole: -10.6019 3.8408 1.7666
dipole: 11.4137
quadrupole: -78.8879 -59.8201 -62.5818
quadrupole: -2.6741 -4.2188 0.4465
quadrupole: -11.7913 7.2765 4.5148 -2.6741 -4.2188 0.4465
hfenergy: -567.7599065 hartree
pointgroup: C01 [X(C5H3O5)]
dipole: -4.1704162 1.5129462 0.6995264 debye
dipolederiv: 0.0337262 -0.2269913 -0.2667258 -0.3797558 -0.7024103 -0.9054609 0.0695374 -0.4735121 0.3680065 -0.4725994 -0.8433165 -0.7174562 0.0808236 0.1914948 0.1949118 -0.3046739 -0.0955011 -0.0839226 0.102434 0.4754066 0.4343819 0.0909093 0.3609394 0.3193622 0.110876 -0.5246104 -0.7152817 -0.6160244 0.1972799 -0.0307571 0.1374144 -0.3969131 0.4400635 0.013912 0.5452018 -0.5246384 0.1595905 -0.0350576 0.0366907 -0.0252939 0.1389315 0.0309467 0.0242284 0.0539632 0.1186869 0.0601984 0.0621284 -0.0102343 0.0380921 0.1423226 0.0176853 -0.0218946 0.0267776 0.164083 0.2976451 2.2858045 1.5087707 0.5549929 0.6921242 0.5056146 0.1093852 -0.2466212 -0.4449916 -0.7450307 -1.9938933 -1.3291479 -0.2320935 0.006035 0.3498461 0.1642383 1.3758139 0.7632945 0.3933592 0.1169119 0.35535 -0.2255153 -0.709407 -1.0076894 -0.1666715 -0.7453061 0.1152584 0.1025828 0.0090159 0.0019809 -0.0003332 0.1522846 0.0520059 0.0554879 0.0592737 0.1066807 2.3426888 -0.0180023 0.0455021 -0.3352748 0.970409 -1.0479236 -0.178867 -0.9992053 1.6659844 -1.2857122 0.2741947 -0.3968312 0.3644936 -0.9729952 0.6171434 -0.2380026 0.4832175 -1.2497051 -1.3728585 -0.303481 0.3684762 -0.0684595 -0.8728155 0.4334942 0.3624445 0.5405084 -1.2834551 unknown
polarizability: 96.584937|3.9083947|98.4020877|-5.2050117|6.3269972|80.3187843 unknown
InChI: InChI=1/5C.5O.3H
charge -1 multiplicity 1
13 atoms
C  0.30340264 0.31895905 0.17730689
C  -0.45680342 1.34458472 -0.42502925
C  -1.74226512 1.21287936 0.06613793
O  -0.42517236 -0.2527735 1.15161891
H  -0.07812791 2.01130874 -1.19370353
H  -2.64074832 1.75259789 -0.21988676
O  -0.52062278 -1.06673869 -1.13929613
O  -1.68109118 -1.23208139 -0.67881656
C  -1.69694686 0.09966005 0.92472371
H  -2.44894385 -0.31977698 1.58746174
C  1.80202049 0.03127101 0.0751064
O  2.2713738 -0.72003695 0.94095558
O  2.34780887 0.59455368 -0.88810693
