program: Gaussian 09
title: 000050501
version: EM64L-G09RevD.01
frameworkgroup: C1[X(C19H18ClNO3)]
method: RPBEPBE
basis: SDD
operation: Freq
keyword: #p
keyword: freq=noraman
keyword: PBEPBE/SDD
title: #p freq=noraman PBEPBE/SDD
converged: YES YES NO NO
title: Mulliken charges:
elementType: Cl O O O N C C C C C C C C C C C C C C C C C C C H H H H H H H H H H H H H H H H H H
charge: -0.019899 -0.248250 -0.285221 -0.441825 -0.090049 -0.505125 -0.321193 -0.337348 0.271376 -0.327082 -0.323349 0.341221 0.141543 0.132771 -0.536155 0.343653 -0.362245 -0.391359 0.307301 -0.389389 -0.369574 -0.239620 -0.230604 -0.243716 0.217417 0.248498 0.217964 0.194203 0.190906 0.206765 0.210477 0.192724 0.194747 0.210152 0.257415 0.222050 0.357030 0.249940 0.265532 0.228547 0.228365 0.231409
chargesum: 0.00000
title: Mulliken charges with hydrogens summed into heavy atoms:
elementType: Cl O O O N C C C C C C C C C C C C C C C C C C C
charge: -0.019899 -0.248250 -0.285221 -0.084796 -0.090049 -0.039209 0.090974 0.060322 0.271376 0.076119 0.081549 0.341221 0.141543 0.132771 -0.536155 0.343653 -0.104830 -0.169309 0.307301 -0.139449 -0.104042 -0.011074 -0.002240 -0.012307
polarizability: 3.55648745e+02 4.61693488e+01 2.63000925e+02 -2.75331354e+01 2.67145176e+01 1.38255878e+02
1716.lowfreq: -14.8933 -10.1802 -6.9979 -0.0014 -0.0007 0.0003 14.4844 16.4878 29.3075
frequency: 13.7060 16.2860 28.4927 41.4065 52.3568 87.0827 102.1592 128.7594 132.0786 185.3725 198.8909 222.6276 248.3701 255.3235 260.2370 281.6901 297.1106 307.0558 339.7269 357.3980 376.1500 387.4864 397.9035 400.3327 431.1416 467.4213 480.0579 484.0970 492.9538 531.6364 583.2029 591.3509 611.8801 620.5041 634.0603 651.8937 667.0783 694.6564 728.6912 747.1302 761.9502 777.1487 777.8173 782.4648 806.3021 841.8404 852.7600 879.1519 911.9028 916.4569 931.3485 962.0252 984.3419 987.5215 989.5062 1000.6086 1014.2094 1022.9202 1025.4295 1036.5775 1049.5625 1052.6778 1082.1097 1094.7727 1099.7072 1112.6139 1140.4046 1148.4947 1175.7272 1186.9120 1189.1595 1200.4094 1221.1445 1233.6991 1237.3936 1251.8984 1265.2626 1286.0493 1289.2390 1294.7649 1327.6204 1334.9416 1339.2255 1357.4030 1369.1070 1381.4112 1387.5094 1395.7638 1432.8193 1438.7509 1443.6486 1446.7661 1451.1098 1457.6996 1470.9276 1477.2297 1498.5116 1565.2090 1581.8264 1594.4616 1614.2818 1624.7112 2856.6990 2875.5390 2927.3400 2954.1674 2957.7690 3023.2913 3037.6472 3039.6776 3077.5393 3080.7173 3125.2388 3129.7690 3141.3771 3159.5244 3175.2973 3178.6802 3185.8498 3588.4968
redmass: 5.1093 3.9314 3.1487 9.6445 7.0428 5.6178 5.4829 5.4307 5.1146 12.2206 5.6049 3.1898 3.7756 2.6587 5.6576 5.4042 3.6159 1.1427 5.6348 2.3961 5.8235 3.2969 2.8460 2.8340 5.4105 3.0092 4.9478 4.4698 6.2210 4.2951 5.6171 2.5711 5.4460 3.8836 5.2822 5.8519 5.6184 1.7873 6.5308 5.0986 7.3572 2.1286 2.3788 2.1097 3.9256 1.6000 1.2523 2.6557 1.3882 3.0488 1.4343 3.6375 1.3828 5.8309 3.1425 1.3223 3.5648 3.8018 2.1858 2.4906 2.6442 2.0372 3.4596 1.7371 2.4404 2.4911 2.1948 1.3873 1.0556 1.6843 1.0819 1.1263 1.6368 3.0054 2.1522 3.1372 1.3085 1.5857 1.3421 2.8490 1.2796 1.4145 1.2286 1.4129 1.2683 7.5328 1.5040 3.5091 3.8261 2.7175 1.0824 1.0804 1.1019 1.1168 2.3520 1.1230 3.4357 7.8424 6.2679 8.6417 5.9424 8.2170 1.0701 1.0697 1.0683 1.0661 1.0662 1.0892 1.0903 1.0893 1.0964 1.0982 1.0900 1.0853 1.0902 1.0959 1.0958 1.0957 1.0955 1.0661
irintensity: 0.1417 0.0579 0.0437 0.5173 0.2898 0.1224 0.8958 4.4107 1.3284 1.9204 2.8313 1.5365 5.6988 2.9879 1.7954 2.9966 7.6871 113.1381 0.8165 14.1468 2.8252 1.7946 1.8270 0.0262 1.8530 2.9015 2.6729 10.3419 2.5408 3.6207 7.6724 1.9473 1.2978 1.8109 1.8505 3.5494 23.4327 51.3684 14.6365 1.4550 38.3352 46.6161 46.5775 17.0114 26.9599 0.1776 0.0937 5.2001 4.2355 41.3939 4.7950 23.4421 0.1658 1.0388 23.4528 0.3738 5.4242 33.6147 2.3211 113.7012 7.8237 50.3435 49.7285 3.7139 27.2855 30.0207 57.9811 21.9385 0.2042 29.1441 0.9992 4.3228 61.3231 11.4617 46.7519 37.5633 9.2007 18.3874 5.6580 7.8081 9.3247 0.6841 10.4611 1.0417 2.6897 0.4518 2.4440 111.7919 3.5709 17.1195 2.0543 1.0624 19.1275 2.5553 39.2339 12.0480 0.9907 0.4466 1.9921 37.4640 9.2613 10.6676 87.1869 98.7942 61.3910 26.8288 89.5827 36.2754 14.8779 32.0196 42.1831 46.1411 11.9265 1.0127 16.9388 34.9363 10.4084 3.3094 8.9800 48.3462
temp: 298.150 k
press: 1.00000 atm
elementType: 17 8 8 8 7 6 6 6 6 6 6 6 6 6 6 6 6 6 6 6 6 6 6 6 1 1 1 1 1 1 1 1 1 1 1 1 1 1 1 1 1 1
symmnumber: 1
zpe: 860806.4 jmol-1
zpe.correction: 0.327864 hartree
zpe.thermalcorrener: 0.348716 hartree
zpe.thermalcorrenthalpy: 0.349660 hartree
zpe.thermalcorrgfe: 0.275359 hartree
zpe.sumelectzpe: -1473.537323 hartree
zpe.sumelectthermal: -1473.516470 hartree
zpe.sumelectthermalent: -1473.515526 hartree
zpe.sumelectthermalfe: -1473.589828 hartree
dipole: -1.2477 3.2502 -0.2641
dipole: 3.4914
quadrupole: -143.1608 -127.0567 -149.9883
quadrupole: 17.4659 -6.5278 10.1731
quadrupole: -3.0922 13.0119 -9.9197 17.4659 -6.5278 10.1731
hfenergy: -1473.8651867 hartree
pointgroup: C01 [X(C19H18Cl1N1O3)]
dipole: 0.5317927 1.2592272 0.1357233 debye
polarizability: 352.0513527|-48.3217914|267.3734818|-32.0211225|-21.5235163|137.4807131 unknown
InChI: InChI=1S/C19H18ClNO3/c20-18-17-14(12-21-8-10-23-11-9-21)15(22)6-7-16(17)24-19(18)13-4-2-1-3-5-13/h1-7,22H,8-12H2
charge 0 multiplicity 1
42 atoms
Cl 0.289187 -1.747227 1.28599
O  -4.676684 -2.495947 -1.284761
O  1.905851 1.565607 -0.345547
O  -3.388757 2.811325 0.831218
N  -2.892458 -0.826767 0.283396
C  -2.506655 0.168751 1.325409
C  -3.742887 -0.246749 -0.787208
C  -3.547116 -2.019428 0.876711
C  -1.572026 1.230458 0.773095
C  -4.018946 -1.309904 -1.861271
C  -3.826766 -3.058755 -0.221517
C  -0.20473 0.978525 0.457151
C  0.594787 2.01725 -0.103998
C  -2.036545 2.546028 0.517842
C  0.701962 -0.15093 0.567215
C  1.961164 0.20469 0.081802
C  0.131977 3.310501 -0.363607
C  -1.213333 3.569644 -0.035957
C  3.263713 -0.442127 -0.083196
C  3.478918 -1.818297 0.217023
C  4.361517 0.329991 -0.568261
C  4.752764 -2.395959 0.039504
C  5.629921 -0.25562 -0.742778
C  5.835308 -1.622337 -0.439193
H  -1.997374 -0.390364 2.13108
H  -3.399348 0.66584 1.767513
H  -3.213941 0.609087 -1.244918
H  -4.713174 0.131408 -0.378134
H  -4.510818 -1.75597 1.383263
H  -2.869437 -2.458546 1.633839
H  -4.715992 -0.931231 -2.627374
H  -3.061712 -1.610469 -2.339549
H  -2.863432 -3.40338 -0.655723
H  -4.386321 -3.92097 0.17804
H  0.781982 4.076585 -0.793274
H  -1.631233 4.568402 -0.213391
H  -3.61728 3.750354 0.622972
H  2.655388 -2.435044 0.583316
H  4.205323 1.386113 -0.804128
H  4.899003 -3.45582 0.275094
H  6.460208 0.354141 -1.115699
H  6.822689 -2.077061 -0.574689
