program: Orca
programVersion: 5.0.4
elementType: S S Cl N N O O C C C C C C C C C C N N C N C C N C C H H H H H H H H H H H H H O H H
charge: 0
multiplicity: 1
keywords: wB97M-V def2-QZVP AutoAux Defgrid3 VeryTightSCF CPCM(water)
formula: C15H15ClN6O3S2
InChI: InChI=1/C15H15ClN6O3S2/c16-6-3-1-5(2-4-6)7(8-10(17)19-14(26)21-12(8)23)9-11(18)20-15(27-28-25)22-13(9)24/h1-4,7,22-23,26H,17-18,25H2
42 atoms
S  4.591529 -3.119767 -2.272717
S  -5.196794 -0.337641 -1.583738
Cl 1.977315 5.554934 2.690046
N  1.42724 0.708611 -2.11513
N  -1.342094 -2.228822 0.912957
O  1.749061 -2.227131 1.624912
O  -0.905835 2.04447 -1.196195
C  0.418074 0.058735 0.627704
C  2.473426 3.21818 1.375331
C  2.109722 1.963835 0.885733
C  1.532327 3.96541 2.066092
C  0.822733 1.464347 1.070012
C  0.244907 3.486447 2.28654
C  -0.096358 2.237007 1.787282
C  -0.964721 -0.026457 -0.006499
C  -1.490583 1.006442 -0.821323
C  -1.766415 -1.155907 0.216032
N  -2.819174 0.82287 -1.24753
N  -3.048216 -1.26635 -0.25965
C  -3.559287 -0.274621 -0.969899
N  2.858105 -1.080618 -2.111117
C  3.349263 -2.12402 -1.465037
C  1.912207 -0.354572 -1.456366
N  3.032277 -2.554764 -0.243056
C  1.482132 -0.697272 -0.149669
C  2.102999 -1.820448 0.382598
H  4.627465 -2.396063 -3.405052
H  -5.384198 -1.829742 -0.925982
H  1.769762 0.888593 -3.04585
H  0.697935 1.308873 -1.729922
H  -0.417031 -2.291113 1.308491
H  -1.980203 -2.988862 1.086286
H  -5.047111 -3.589393 -0.889392
H  -4.156764 -2.491931 -0.11808
H  0.326626 -0.467932 1.585821
H  3.477424 3.599338 1.219394
H  2.854106 1.376125 0.3568
H  -0.477692 4.077583 2.83981
H  -1.101814 1.85788 1.954944
O  -5.113628 -2.839761 -0.274928
H  2.245192 -3.035873 1.83124
H  -3.213909 1.559379 -1.820895
elementType: S Cl N O C H
totalener: -2391.67532699 hartree
nucrepener: 2963.86037270 hartree
electener: -5355.53569969 hartree
oneelecener: -9180.14465552 hartree
twoeener: 3824.60895583 hartree
cpcmener: -0.04829497 hartree
kineticenergy: 2386.31185695 hartree
xcener: -170.577983782481 hartree
chargesum: -0.0000000
charge: -0.086405 -0.297314 -0.161086 -0.349667 -0.349598 -0.393883 -0.496823 0.118565 -0.088227 -0.100325 0.009763 0.063701 -0.086479 -0.114120 -0.008457 0.267638 0.216751 -0.206898 -0.348621 0.115009 -0.391394 0.152974 0.245306 -0.374005 0.022358 0.230176 0.141394 0.251063 0.226201 0.188213 0.201194 0.235719 0.348682 0.309433 -0.044669 0.122811 0.084963 0.123246 0.112699 -0.447478 0.317182 0.240410
charge: 0.625217 0.413967 0.439718 0.720938 0.728919 0.719704 0.257800 -0.026077 0.037890 0.086512 -0.465949 -0.071637 0.036836 0.093783 -0.110119 -0.625895 -0.373296 0.575932 0.358908 -0.700955 0.281757 -0.768514 -0.406506 0.266398 -0.100820 -0.519213 -0.215473 -0.325221 -0.150364 -0.215274 -0.175159 -0.141224 -0.257859 -0.329660 -0.013129 -0.049907 -0.043734 -0.049885 -0.037469 0.946798 -0.301099 -0.116639
qa: -0.0864 -0.2973 -0.1611 -0.3497 -0.3496 -0.3939 -0.4968 0.1186 -0.0882 -0.1003 0.0098 0.0637 -0.0865 -0.1141 -0.0085 0.2676 0.2168 -0.2069 -0.3486 0.1150 -0.3914 0.1530 0.2453 -0.3740 0.0224 0.2302 0.1414 0.2511 0.2262 0.1882 0.2012 0.2357 0.3487 0.3094 -0.0447 0.1228 0.0850 0.1232 0.1127 -0.4475 0.3172 0.2404
va: 2.2834 2.1032 1.1420 3.1485 3.1954 2.1362 1.9961 3.5785 3.9086 3.8817 3.9010 3.7795 3.8979 3.8769 3.4428 4.1469 3.9506 3.2453 2.9902 4.3018 2.9850 4.2656 3.9285 2.9828 3.5850 4.0186 1.0178 1.0686 1.0026 1.0968 1.0565 0.9881 0.9384 1.0443 1.0526 0.9845 1.0111 0.9863 0.9964 2.1579 0.9603 0.9910
energy: -2391.675326989423
dipole: -10.54113 8.35062 -2.19051 -14.15968 10.64262 -3.51706 -2.50151 2.87916 0.37765
magnitude: 4.16061 au
magnitude: 10.57542 debye
