program: Orca
programVersion: 5.0.4
elementType: S S Cl N N O O C C C C C C C C C C N N C N C C N C C H H H H H H H H H H H H H O H H
charge: 0
multiplicity: 1
keywords: wB97M-V def2-QZVP AutoAux Defgrid3 VeryTightSCF CPCM(water)
formula: C15H15ClN6O3S2
InChI: InChI=1/C15H13ClN6O2S2.H2O/c16-6-3-1-5(2-4-6)7(8-10(17)19-14(25)21-12(8)23)9-11(18)20-15(26)22-13(9)24;/h1-4,7,19,21,24,26H,17-18H2;1H2
42 atoms
S  3.924204 -4.324309 -2.172827
S  -5.775867 -1.274677 -1.588461
Cl 1.508854 4.375888 2.853949
N  0.891844 -0.392443 -2.002149
N  -2.024821 -3.289852 0.953459
O  1.037053 -3.406123 1.686002
O  -1.42897 0.996532 -1.084607
C  -0.181097 -1.051659 0.717267
C  1.953876 2.038959 1.522349
C  1.56053 0.800475 1.015825
C  1.026484 2.805901 2.210078
C  0.257785 0.336947 1.180815
C  -0.276233 2.361479 2.411973
C  -0.64719 1.127294 1.896361
C  -1.558781 -1.085922 0.066987
C  -2.050623 -0.023554 -0.738868
C  -2.3815 -2.192343 0.269393
N  -3.383681 -0.145249 -1.184257
N  -3.655555 -2.216631 -0.25857
C  -4.198592 -1.203674 -0.98094
N  2.260253 -2.229177 -2.004301
C  2.702364 -3.301237 -1.369645
C  1.329804 -1.481477 -1.352758
N  2.346355 -3.743597 -0.162262
C  0.866154 -1.830946 -0.059543
C  1.433324 -2.987994 0.460402
H  4.009075 -3.579474 -3.288789
H  -6.134216 -3.778071 -0.694162
H  1.260672 -0.203148 -2.920853
H  0.18651 0.230773 -1.613884
H  -1.109024 -3.380468 1.368107
H  -2.687304 -4.026893 1.139578
H  -5.352784 -5.090884 -0.642732
H  -4.250812 -3.049882 -0.128321
H  -0.298346 -1.586339 1.668097
H  2.969931 2.392881 1.381226
H  2.293989 0.197144 0.489398
H  -0.987946 2.967242 2.96344
H  -1.664679 0.775452 2.050532
O  -5.594394 -4.327189 -0.102757
H  1.49748 -4.237101 1.886938
H  -3.740839 0.62055 -1.743748
elementType: S Cl N O C H
totalener: -2391.70639079 hartree
nucrepener: 2955.29306839 hartree
electener: -5346.99945918 hartree
oneelecener: -9161.40560842 hartree
twoeener: 3814.40614924 hartree
cpcmener: -0.05030349 hartree
kineticenergy: 2386.33391519 hartree
xcener: -170.586932807599 hartree
chargesum: -0.0000000
charge: -0.084592 -0.420280 -0.159530 -0.345695 -0.328593 -0.393665 -0.467861 0.123819 -0.087306 -0.100560 0.009543 0.064133 -0.085901 -0.115797 0.018169 0.259341 0.221029 -0.185830 -0.142449 0.108693 -0.389806 0.153695 0.243407 -0.372292 0.024183 0.229933 0.141678 0.304937 0.227489 0.187613 0.209753 0.246253 0.330994 0.189621 -0.045961 0.123594 0.085247 0.123883 0.113379 -0.575782 0.318588 0.242924
charge: 0.627213 0.163851 0.441542 0.723177 0.749654 0.721744 0.279251 -0.023734 0.039075 0.087362 -0.465473 -0.072341 0.038062 0.094204 -0.106632 -0.617446 -0.298779 0.582765 0.587112 -0.734304 0.283009 -0.767287 -0.406010 0.267704 -0.100147 -0.518411 -0.214959 -0.357802 -0.148941 -0.211068 -0.165505 -0.131722 -0.324307 -0.170621 -0.011566 -0.049541 -0.043328 -0.049492 -0.036990 0.753572 -0.299842 -0.113048
qa: -0.0846 -0.4203 -0.1595 -0.3457 -0.3286 -0.3937 -0.4679 0.1238 -0.0873 -0.1006 0.0095 0.0641 -0.0859 -0.1158 0.0182 0.2593 0.2210 -0.1858 -0.1424 0.1087 -0.3898 0.1537 0.2434 -0.3723 0.0242 0.2299 0.1417 0.3049 0.2275 0.1876 0.2098 0.2463 0.3310 0.1896 -0.0460 0.1236 0.0852 0.1239 0.1134 -0.5758 0.3186 0.2429
va: 2.2853 1.8838 1.1439 3.1553 3.2450 2.1374 2.0315 3.5850 3.9078 3.8823 3.9043 3.7796 3.8983 3.8816 3.4657 4.1682 3.9084 3.2272 3.2006 4.3128 2.9870 4.2656 3.9321 2.9842 3.5849 4.0182 1.0177 0.9991 1.0019 1.0925 1.0519 0.9798 0.9555 1.1111 1.0541 0.9843 1.0113 0.9861 0.9959 2.0117 0.9589 0.9944
energy: -2391.706390785810
dipole: -10.21411 9.40214 -0.81197 -14.61168 11.45708 -3.15461 -2.31186 3.05709 0.74523
magnitude: 3.34159 au
magnitude: 8.49364 debye
