program: Orca
programVersion: 5.0.4
elementType: S S N N O O C C C C C N N C N C C N C C H H H H H H H H H H H H H C H C C H H H H H H
keywords: PBE0 aug-cc-pVDZ AutoAux D4 VeryTightSCF
charge: 2
multiplicity: 1
formula: C13H20N6O2S2
InChI: InChI=1/C13H20N6O2S2/c1-4(2)3-5(6-8(14)16-12(22)18-10(6)20)7-9(15)17-13(23)19-11(7)21/h4-5,16-19H,3H2,1-2,14-15H3
43 atoms
S  3.779492 -1.76699 -4.191895
S  -5.674418 0.410108 -1.44649
N  0.326712 -3.835164 -1.236088
N  -1.089472 1.536348 0.144028
O  1.205098 0.863164 -0.984264
O  -2.222366 -3.004478 -0.868065
C  -0.215702 -1.389548 0.261296
C  0.41691 -0.807168 1.531465
C  -1.54374 -0.836562 -0.192047
C  -2.48295 -1.810872 -0.711349
C  -1.956393 0.446556 -0.218506
N  -3.725929 -1.349206 -1.053922
N  -3.200209 0.817594 -0.605464
C  -4.152866 -0.060499 -1.017713
N  1.916435 -2.702814 -2.561451
C  2.647792 -1.642018 -2.999294
C  1.016889 -2.611048 -1.55596
N  2.347653 -0.475555 -2.369948
C  0.74778 -1.466243 -0.894674
C  1.417161 -0.283925 -1.381711
H  0.37199 -4.519034 -1.997738
H  -0.698279 -3.615282 -1.052299
H  -0.109636 1.332467 -0.240006
H  -1.403709 2.429102 -0.251434
H  -0.453669 -2.415196 0.541467
H  2.83354 0.354901 -2.693395
H  2.084533 -3.594827 -3.016107
H  -3.468166 1.796666 -0.58148
H  -4.386937 -2.043263 -1.387536
H  -1.035505 1.656713 1.162703
H  0.723938 -4.280796 -0.399321
H  0.787683 0.208335 1.388699
H  1.305949 -1.417476 1.725182
C  -0.481836 -0.857561 2.767035
H  -1.347969 -0.202646 2.605334
C  0.290685 -0.31307 3.959133
C  -1.006299 -2.256969 3.05418
H  -1.685634 -2.618325 2.277125
H  -1.561094 -2.269496 3.996075
H  -0.182119 -2.973002 3.142864
H  0.668015 0.6949 3.763478
H  1.149209 -0.951955 4.19175
H  -0.342658 -0.268004 4.849007
elementType: S N O C H
totalener: -1781.34037931 hartree
nucrepener: 2383.68521843 hartree
electener: -4165.02559774 hartree
oneelecener: -7128.26476260 hartree
twoeener: 2963.23916486 hartree
cpcmener: -0.37988521 hartree
kineticenergy: 1774.44789214 hartree
exchangeener: -134.850718157216 hartree
correlationener: -6.504190808867 hartree
xcener: -141.354908966083 hartree
chargesum: 2.0000000
charge: -0.216234 -0.232715 -0.659840 -0.771942 -1.010495 -1.015691 1.169506 1.041271 0.557762 0.746918 0.910011 -0.496481 -0.446373 0.432233 -0.460115 0.405428 0.747210 -0.492069 0.824480 0.587256 0.302279 0.238850 0.301470 0.299205 -0.683162 0.045326 0.008274 -0.003478 0.043918 0.431253 0.380578 -0.679539 -0.242655 -0.995535 -0.548738 1.109356 1.237098 -0.101439 -0.364427 -0.051907 -0.145801 -0.058626 -0.142421
charge: 0.557543 0.555970 0.537077 0.529745 0.161775 0.154954 -0.102060 0.045287 0.004628 -0.260551 -0.068553 0.182037 0.181346 -0.694361 0.182610 -0.692760 -0.060696 0.182465 0.008038 -0.249264 0.117708 -0.041429 -0.059953 0.118143 0.026611 0.064252 0.074063 0.072565 0.064623 0.114230 0.131750 0.019118 0.056841 -0.280401 0.049246 0.156099 0.163683 -0.005981 -0.000766 0.008996 -0.002769 0.001429 -0.003287
qa: -0.2162 -0.2327 -0.6598 -0.7719 -1.0105 -1.0157 1.1695 1.0413 0.5578 0.7469 0.9100 -0.4965 -0.4464 0.4322 -0.4601 0.4054 0.7472 -0.4921 0.8245 0.5873 0.3023 0.2389 0.3015 0.2992 -0.6832 0.0453 0.0083 -0.0035 0.0439 0.4313 0.3806 -0.6795 -0.2427 -0.9955 -0.5487 1.1094 1.2371 -0.1014 -0.3644 -0.0519 -0.1458 -0.0586 -0.1424
va: 1.7798 1.7733 2.7130 2.8947 1.2618 1.3789 -0.3522 2.8516 1.7639 0.3470 -4.3489 2.8274 2.5547 3.1308 2.6988 3.1690 -4.8405 2.8817 1.4358 1.0449 0.7056 1.0270 0.8906 0.6946 0.5489 0.8487 0.8471 0.8499 0.8566 0.6751 0.7372 0.0833 0.3298 6.0271 0.2616 3.2337 2.9652 0.6713 0.5092 0.5955 0.6440 0.6421 0.5865
energy: 30268.2 30317.1 32770.6 33545.4 33834.4 34073.3 35294.5 35749.3 36681.0 36856.1 38630.8 40194.2 40944.5 41115.8 41299.5 41370.8 44236.6 44509.3 44741.1 45131.4 46424.2 47055.4 47067.4 47558.8 47666.5 47912.7 48400.5 48666.4 49361.0 50217.9 50307.5 50676.0 50798.5 51016.7 51139.0 51143.0 51517.8 51557.3 51615.6 51767.4 51974.9 52018.8 52094.1 52427.4 52817.7 52865.0 53058.7 53102.0 53766.4 53953.1 53994.0 54018.2 54480.3 54571.4 54718.5 54738.4 54946.3 55095.3 55358.2 55669.2 56067.6 56218.3 56247.5 56308.2 56361.3 56723.3 57080.2 57112.5 57131.0 57236.8 57322.5 57355.4 57512.7 57629.4 57661.9 57944.8 58020.7 58154.1 58328.6 58458.1 58641.9 58695.0 58846.8 59198.9 59231.0 59492.5 59538.3 59640.9 59725.0 59786.2 59892.2 60187.3 60318.2 60547.5 60770.0 60988.4 61145.0 61171.7 61248.1 61352.3 61507.0 61785.1 61856.6 61923.3 62080.4 62339.2 62572.4 62750.6 62814.6 62833.2 62879.7 62935.3 63060.3 63163.5 63261.0 63330.0 63413.3 63482.8 63545.2 63601.2 63653.0 63775.1 63870.2 63897.3 64061.7 64124.9 64203.8 64264.7 64333.6 64343.7 64426.1 64498.5 64661.9 64695.9 64721.9 64877.4 64924.6 64998.1 65111.6 65259.8 65316.9 65353.9 65448.1 65563.7 65624.5 65670.9 65737.0 65905.0 65977.8 66050.4 66066.5 66164.5 66211.1 66373.7 66493.2 66559.4 66635.3 66695.2 66794.7 66900.6 66981.8 67006.1 67136.3 67203.1 67256.3 67306.9 67335.0 67516.1 67628.1 67708.4 67802.3 67886.1 67947.9 67994.6 68124.0 68129.4 68305.5 68320.1 68445.8 68550.5 68577.0 68595.7 68635.0 68655.1 68827.4 68856.3 68905.9 68973.8 69040.2 69060.4 69163.5 69179.3 69195.7 69325.0 69375.7 69484.4 69589.2 69609.0 69637.7 69759.7
energy: -1781.255942841586
dipole: 3.98066 -2.98164 0.99902 -2.80510 1.82056 -0.98454 31.14551 -29.03077 2.11474
magnitude: 2.53761 au
magnitude: 6.45010 debye
