program: Orca
programVersion: 5.0.4
elementType: S S N N O O C C C C C N N C N C C N C C H H H H H H H H H H C H C C H H H H H H H
keywords: PBE0 ma-def2-TZVP AutoAux D4 VeryTightSCF TightOPT
charge: 0
multiplicity: 1
formula: C13H18N6O2S2
InChI: InChI=1/C13H18N6O2S2/c1-4(2)3-5(6-8(14)16-12(22)18-10(6)20)7-9(15)17-13(23)19-11(7)21/h4-5,16-19H,3,14-15H2,1-2H3
41 atoms
S  4.033195 -4.163591 -2.521751
S  -5.926587 -1.60011 -1.105117
N  0.870146 -0.400801 -2.246372
N  -1.908712 -3.242469 1.226058
O  0.942644 -3.623084 1.242404
O  -1.594852 0.64273 -1.494233
C  -0.152123 -1.079857 0.48469
C  0.263044 0.367995 0.807547
C  -1.577044 -1.207618 -0.009013
C  -2.162875 -0.291433 -0.914901
C  -2.353973 -2.265575 0.433374
N  -3.523315 -0.468678 -1.184183
N  -3.67537 -2.344097 0.073316
C  -4.30732 -1.455996 -0.723283
N  2.268262 -2.214811 -2.212508
C  2.824104 -3.339873 -1.716039
C  1.293309 -1.476825 -1.585846
N  2.317192 -3.739315 -0.537668
C  0.84051 -1.865935 -0.338876
C  1.322278 -3.088042 0.192872
H  2.609133 -1.903427 -3.11362
H  -4.229753 -3.120227 0.411467
H  1.193216 -0.235599 -3.186995
H  0.019004 0.083544 -1.943204
H  -0.905006 -3.378896 1.355147
H  -2.515115 -4.016268 1.450597
H  2.681105 -4.595845 -0.140999
H  -3.944566 0.201051 -1.814504
H  -0.148987 -1.583977 1.452729
H  0.596283 0.898796 -0.084173
C  1.334505 0.530238 1.892627
H  -0.635665 0.888778 1.151654
C  2.723644 0.073822 1.46904
C  0.939037 -0.103084 3.219147
H  1.394716 1.61348 2.058955
H  2.78485 -1.01226 1.364956
H  3.465618 0.370184 2.216858
H  3.018693 0.521346 0.515709
H  0.972138 -1.195951 3.174415
H  -0.071737 0.189682 3.519826
H  1.625462 0.205939 4.012616
totalener: -1780.73583428 hartree
nucrepener: 2343.38200376 hartree
electener: -4124.11783805 hartree
oneelecener: -7099.22796725 hartree
twoeener: 2975.11012921 hartree
cpcmener: -0.05395527 hartree
kineticenergy: 1775.04690259 hartree
exchangeener: -134.796151609211 hartree
correlationener: -6.490693144932 hartree
xcener: -141.286844754143 hartree
elementType: S N O C H
chargesum: 0.0000000
charge: -0.574604 -0.574710 -0.591294 -0.564892 -0.567201 -0.554241 0.205158 -0.279692 -0.240564 0.245764 0.214121 -0.178816 -0.159132 0.193441 -0.208254 0.147140 0.159669 -0.257580 0.282394 0.338426 0.322059 0.321368 0.322564 0.325363 0.310872 0.326527 0.316502 0.315627 0.143872 0.166516 -0.398967 0.162033 -0.283745 -0.408184 0.103592 0.145626 0.153903 0.148658 0.160619 0.154481 0.155582
charge: 0.127795 0.128085 0.003391 0.004456 -0.072208 -0.064752 -0.216162 -0.254670 -0.138690 -0.383147 -0.257705 0.124844 0.129105 -0.615375 0.127564 -0.617213 -0.270649 0.122258 -0.153062 -0.398314 0.268048 0.267648 0.229400 0.223537 0.223876 0.229463 0.265809 0.265212 0.231553 0.193007 -0.388507 0.196928 -0.333122 -0.343292 0.190597 0.168736 0.152696 0.160992 0.161471 0.157657 0.152740
qa: -0.5746 -0.5747 -0.5913 -0.5649 -0.5672 -0.5542 0.2052 -0.2797 -0.2406 0.2458 0.2141 -0.1788 -0.1591 0.1934 -0.2083 0.1471 0.1597 -0.2576 0.2824 0.3384 0.3221 0.3214 0.3226 0.3254 0.3109 0.3265 0.3165 0.3156 0.1439 0.1665 -0.3990 0.1620 -0.2837 -0.4082 0.1036 0.1456 0.1539 0.1487 0.1606 0.1545 0.1556
va: 1.6347 1.6351 2.9911 3.0649 1.7597 1.7732 3.3045 4.0911 3.5881 4.2093 4.2437 3.2071 3.1846 4.0473 3.2558 4.0770 4.3600 3.2887 2.2268 4.1382 0.9038 0.9047 0.9128 0.9448 0.9480 0.9108 0.9078 0.9084 0.9687 0.9555 4.3624 0.9436 3.6325 3.7700 0.9481 0.9622 0.9532 0.9584 0.9572 0.9563 0.9563
energy: -1780.791438044962
dipole: 12.32834 -12.31080 0.01754 13.81497 -13.43176 0.38321 18.26709 -17.81358 0.45351
magnitude: 0.59399 au
magnitude: 1.50981 debye
