program: Orca
programVersion: 5.0.4
elementType: S S N N O O C C C C C N N C N C C N C C H H H H H H H H H H H H H H
keywords: PBE0 ma-def2-TZVP AutoAux D4 VeryTightSCF TightOPT
charge: 2
multiplicity: 1
formula: C10H14N6O2S2
InChI: InChI=1/C10H14N6O2S2/c1-2(3-5(11)13-9(19)15-7(3)17)4-6(12)14-10(20)16-8(4)18/h2,13-16H,1,11-12H3
34 atoms
S  3.71491 -1.785418 -4.094685
S  -5.63625 0.474708 -1.350584
N  0.317132 -3.876875 -1.080945
N  -1.076995 1.479255 0.410147
O  1.149434 0.826054 -0.864042
O  -2.213458 -2.986032 -0.87284
C  -0.23021 -1.428389 0.402284
C  0.392753 -0.827821 1.662029
C  -1.546479 -0.858858 -0.064144
C  -2.47185 -1.801079 -0.659838
C  -1.954515 0.42498 -0.023831
N  -3.702458 -1.311196 -1.01064
N  -3.183865 0.82566 -0.421815
C  -4.126577 -0.024064 -0.909914
N  1.891064 -2.740084 -2.430172
C  2.600075 -1.67082 -2.884618
C  1.006192 -2.655581 -1.412844
N  2.292926 -0.504885 -2.257059
C  0.732927 -1.511399 -0.752581
C  1.375799 -0.319864 -1.255047
H  0.400983 -4.587783 -1.814617
H  -0.713053 -3.648334 -0.94492
H  -0.111538 1.286491 -0.005446
H  -1.387297 2.401443 0.084763
H  -0.482543 -2.448153 0.694581
H  2.761101 0.327941 -2.598151
H  2.064574 -3.632252 -2.882813
H  -3.44689 1.803493 -0.344447
H  -4.358109 -1.974367 -1.410021
H  -1.006215 1.524949 1.433726
H  0.682895 -4.291461 -0.214163
H  0.899914 0.123059 1.509818
H  1.139559 -1.528046 2.038877
H  -0.37148 -0.706279 2.432133
totalener: -1663.74652972 hartree
nucrepener: 1912.80072093 hartree
electener: -3576.54725065 hartree
oneelecener: -6037.68292762 hartree
twoeener: 2461.13567698 hartree
cpcmener: -0.37610477 hartree
kineticenergy: 1658.58619684 hartree
exchangeener: -121.724855187100 hartree
correlationener: -5.704618921110 hartree
xcener: -127.429474108209 hartree
elementType: S N O C H
chargesum: 2.0000000
charge: -0.472198 -0.475654 -0.362692 -0.338813 -0.492470 -0.487063 -0.648719 -0.601792 0.536533 0.129522 -0.221147 -0.159070 -0.131426 0.209404 -0.113360 0.202831 -0.044393 -0.162898 1.077294 0.107719 0.385913 0.349220 0.331812 0.386312 0.233590 0.333037 0.345434 0.345549 0.332441 0.407034 0.407253 0.196124 0.190379 0.204296
charge: 0.232027 0.228928 0.174892 0.164257 -0.005697 -0.006308 -0.215564 -0.263263 -0.087507 -0.328457 -0.189536 0.157663 0.153613 -0.596309 0.155559 -0.595002 -0.182723 0.158861 -0.087743 -0.330883 0.271258 0.248228 0.244018 0.272042 0.236713 0.277332 0.279986 0.279756 0.277209 0.276259 0.279171 0.171454 0.173426 0.176340
qa: -0.4722 -0.4757 -0.3627 -0.3388 -0.4925 -0.4871 -0.6487 -0.6018 0.5365 0.1295 -0.2211 -0.1591 -0.1314 0.2094 -0.1134 0.2028 -0.0444 -0.1629 1.0773 0.1077 0.3859 0.3492 0.3318 0.3863 0.2336 0.3330 0.3454 0.3455 0.3324 0.4070 0.4073 0.1961 0.1904 0.2043
va: 1.7768 1.7735 3.4338 3.3848 1.9312 1.8817 4.9704 4.1819 3.1828 4.3970 4.5947 3.3353 3.2506 4.0398 3.2273 4.0308 4.4174 3.3386 1.3080 4.3862 0.8589 0.9407 0.9662 0.8594 0.9171 0.8964 0.8865 0.8866 0.8975 0.8295 0.8300 0.9456 0.9491 0.9361
energy: -1663.792914906995
dipole: 3.93304 -2.77719 1.15585 -1.63589 0.37969 -1.25620 13.67759 -9.23088 4.44672
magnitude: 4.76312 au
magnitude: 12.10690 debye
