program: Orca
programVersion: 5.0.4
elementType: S S N N O O C C C C C N N C N C C N C C H H H H H H H H H H H H H H
keywords: PBE0 aug-cc-pVDZ AutoAux D4 VeryTightSCF
charge: 2
multiplicity: 1
formula: C10H14N6O2S2
InChI: InChI=1/C10H14N6O2S2/c1-2(3-5(11)13-9(19)15-7(3)17)4-6(12)14-10(20)16-8(4)18/h2,13-18H,11-12H2,1H3
34 atoms
S  3.48876 -1.801481 -4.294453
S  -5.529651 0.66471 -1.585378
N  0.780709 -3.934982 -0.754987
N  -1.234215 1.401912 0.74444
O  0.886524 0.845773 -1.200264
O  -2.243185 -2.863819 -1.203172
C  -0.259691 -1.444062 0.370775
C  0.376875 -0.907976 1.660695
C  -1.587345 -0.842622 -0.069596
C  -2.461138 -1.632005 -0.825436
C  -2.020288 0.468413 0.142289
N  -3.635889 -1.165441 -1.261022
N  -3.203746 0.88458 -0.337017
C  -4.11284 0.118362 -1.059476
N  2.016915 -2.792697 -2.328805
C  2.501484 -1.693211 -3.029886
C  1.197341 -2.750065 -1.265718
N  2.034242 -0.506883 -2.492968
C  0.731773 -1.524559 -0.775063
C  1.196904 -0.395449 -1.453036
H  1.139891 -4.786647 -1.164889
H  -1.375321 -3.219815 -0.955911
H  0.251583 0.995118 -0.472719
H  -1.610152 2.334889 0.854809
H  -0.525523 -2.471497 0.634644
H  2.354232 0.342703 -2.946716
H  2.376194 -3.676624 -2.670057
H  -3.530099 1.826585 -0.154044
H  -4.236847 -1.785601 -1.794727
H  -0.705391 1.097506 1.550184
H  0.661094 -4.008394 0.244371
H  0.928245 0.024623 1.52482
H  1.114974 -1.626296 2.019782
H  -0.36396 -0.796061 2.456712
totalener: -1663.22010497 hartree
nucrepener: 1905.08662932 hartree
electener: -3568.30673429 hartree
oneelecener: -6023.19303148 hartree
twoeener: 2454.88629719 hartree
kineticenergy: 1657.44168642 hartree
exchangeener: -121.674475192819 hartree
correlationener: -5.715182483643 hartree
xcener: -127.389657676462 hartree
chargesum: 2.0000000
charge: 0.044409 0.049414 -0.357990 -0.283463 -0.656647 -0.640385 0.030778 1.061761 1.371002 0.398235 0.356049 -0.440710 -0.442170 0.418447 -0.401239 0.415211 0.517647 -0.396843 1.323139 0.226709 0.020148 0.318149 0.353755 0.024737 -0.836806 -0.017346 -0.037633 -0.040894 -0.008723 -0.013429 0.114547 0.010065 -0.416066 -0.063857
charge: 0.806198 0.811209 0.367799 0.368758 0.366849 0.370745 -0.146071 0.207373 -0.023000 -0.169179 -0.166695 0.180868 0.176877 -0.697453 0.175410 -0.698329 -0.173774 0.179011 -0.031160 -0.174268 0.035136 -0.054719 -0.085389 0.041323 0.027863 0.067031 0.055024 0.055545 0.069148 -0.018160 0.021685 0.004647 0.022230 0.027471
qa: 0.0444 0.0494 -0.3580 -0.2835 -0.6566 -0.6404 0.0308 1.0618 1.3710 0.3982 0.3560 -0.4407 -0.4422 0.4184 -0.4012 0.4152 0.5176 -0.3968 1.3231 0.2267 0.0201 0.3181 0.3538 0.0247 -0.8368 -0.0173 -0.0376 -0.0409 -0.0087 -0.0134 0.1145 0.0101 -0.4161 -0.0639
va: 2.0043 2.0084 2.9393 2.7308 1.2342 1.3569 2.0173 3.4289 1.2559 -0.6476 -0.3039 2.8527 2.7954 3.1460 2.7616 3.1345 -1.0020 2.7392 1.0694 0.1963 0.8695 0.8685 0.8150 0.8589 0.3493 0.8988 0.8860 0.8845 0.8985 1.1115 0.9107 0.5493 0.6371 0.5123
energy: 26670.6 27057.5 27656.0 27664.4 28803.3 29245.1 30355.0 31832.5 31873.8 33311.2 36870.8 37754.4 37997.4 39148.5 42621.5 43566.2 44465.2 44924.9 45075.0 45324.7 46850.5 47189.6 47285.1 48752.8 49230.7 49796.1 50026.9 50777.8 51145.0 51612.3 52358.7 52439.1 52813.7 53002.0 53276.2 53787.0 53896.3 54034.8 54264.5 54586.8 54710.2 54866.2 55436.9 55874.8 56063.1 56173.2 56595.5 56938.0 57057.6 57345.9 57539.6 58056.8 58160.2 58191.4 58388.7 58805.2 59075.2 59114.5 59229.8 59582.8 59705.8 60140.8 60405.0 60528.8 60603.7 60908.4 60967.9 61140.2 61462.6 61558.8 61706.9 61858.5 61992.4 62182.9 62354.0 62373.7 62414.4 62510.5 62615.5 62970.9 63154.1 63464.4 63722.2 63813.4 64236.2 64328.7 64463.7 64518.7 64630.7 64650.0 64696.2 65334.8 65428.3 65504.8 65671.5 65765.9 66053.0 66081.2 66283.6 66372.2 66451.2 66554.0 66851.6 66937.6 66976.8 67047.6 67487.9 67642.6 67822.9 67975.0 68162.9 68255.5 68409.3 68511.9 68599.2 68704.7 68781.8 68799.2 68918.0 69134.8 69168.0 69342.6 69451.5 69599.1 69887.3 70009.2 70220.2 70324.7 70373.0 70388.4 70550.2 70784.6 70864.1 71089.8 71207.4 71248.5 71298.2 71467.1 71546.2 71740.8 71837.3 71984.8 72088.9 72200.4 72331.9 72533.1 72588.2 72730.9 72776.3 72839.6 72949.2 73125.7 73233.7 73336.9 73386.3 73584.9 73606.2 73695.4 73776.7 73832.8 73873.5 73950.6 74041.1 74131.0 74210.4 74291.5 74339.3 74535.5 74581.3 74645.0 74758.5 74800.0 74946.1 75011.4 75125.4 75245.7 75359.3 75444.6 75491.9 75693.6 75800.9 75894.8 76079.6 76190.1 76281.0 76429.6 76451.3 76523.5 76636.2 76750.5 76785.2 76911.1 77138.3 77189.9 77372.7 77504.0 77573.8 77609.5 77762.0 77852.4
energy: -1663.141118544013
dipole: 4.63299 -3.99270 0.64030 -2.36887 1.60693 -0.76195 15.73094 -12.89960 2.83134
magnitude: 3.00117 au
magnitude: 7.62837 debye
