program: Orca
programVersion: 5.0.4
elementType: S S N N O O C C C C C N N C N C C N C C H H H H H H H H H H H H
keywords: PBE0 aug-cc-pVDZ AutoAux D4 VeryTightSCF
charge: 0
multiplicity: 1
formula: C10H12N6O2S2
InChI: InChI=1/C10H12N6O2S2/c1-2(3-5(11)13-9(19)15-7(3)17)4-6(12)14-10(20)16-8(4)18/h2,13-16H,11-12H2,1H3
32 atoms
S  -4.20609 -4.05556 -2.11971
S  5.77265 -1.51966 -1.32738
N  -0.99627 -0.33673 -1.94087
N  1.9197 -3.27254 1.18057
O  -0.99124 -3.5658 1.54327
O  1.47831 0.81552 -1.2056
C  0.14585 -1.05399 0.72256
C  -0.29958 0.3567 1.11525
C  1.52878 -1.15135 0.11832
C  2.07038 -0.17813 -0.74629
C  2.31856 -2.24819 0.42878
N  3.39887 -0.34974 -1.13329
N  3.60532 -2.32116 -0.03777
C  4.1947 -1.38324 -0.81159
N  -2.42143 -2.12167 -1.85943
C  -2.96858 -3.2474 -1.35113
C  -1.41193 -1.40412 -1.26697
N  -2.42671 -3.65769 -0.19054
C  -0.90815 -1.81566 -0.04507
C  -1.40023 -3.02072 0.50183
H  -2.79253 -1.80028 -2.74487
H  4.16949 -3.12514 0.20534
H  -1.37364 -0.14216 -2.85469
H  -0.16537 0.17658 -1.64211
H  0.93961 -3.3809 1.43135
H  2.53571 -4.05678 1.3287
H  -2.78457 -4.51126 0.21802
H  3.78402 0.36345 -1.73857
H  0.21418 -1.58023 1.67705
H  -0.5872 0.98593 0.27629
H  -1.15998 0.27584 1.7829
H  0.50111 0.86523 1.6567
elementType: S N O C H
totalener: -1662.68469706 hartree
nucrepener: 1850.73502851 hartree
electener: -3513.41972557 hartree
oneelecener: -5957.24560879 hartree
twoeener: 2443.82588322 hartree
cpcmener: -0.06500465 hartree
kineticenergy: 1656.72094037 hartree
exchangeener: -121.529306013623 hartree
correlationener: -5.709556754380 hartree
xcener: -127.238862768003 hartree
chargesum: 0.0000000
charge: -0.305711 -0.307918 -0.035024 -0.174797 -0.960075 -0.948386 -0.385015 1.169137 1.123658 0.795799 0.188502 -0.474777 -0.458487 0.445692 -0.426753 0.437901 -0.168504 -0.505143 1.296419 0.812220 -0.003101 0.011539 -0.064073 0.018455 -0.004495 -0.024765 0.013803 -0.001589 -0.546325 -0.216868 -0.162964 -0.138357
charge: 0.469110 0.469823 0.372794 0.374958 0.050065 0.061902 -0.162094 0.182734 -0.043977 -0.337224 -0.175564 0.153529 0.166638 -0.716740 0.166043 -0.716114 -0.178413 0.153644 -0.048829 -0.344519 0.054340 0.054877 0.033729 -0.101636 -0.080105 0.034584 0.045932 0.045048 0.027905 -0.026517 0.006017 0.008059
qa: -0.3057 -0.3079 -0.0350 -0.1748 -0.9601 -0.9484 -0.3850 1.1691 1.1237 0.7958 0.1885 -0.4748 -0.4585 0.4457 -0.4268 0.4379 -0.1685 -0.5051 1.2964 0.8122 -0.0031 0.0115 -0.0641 0.0185 -0.0045 -0.0248 0.0138 -0.0016 -0.5463 -0.2169 -0.1630 -0.1384
va: 1.6790 1.6791 2.9050 2.9756 1.2805 1.2085 2.4841 3.3204 1.0762 0.4636 -1.0133 2.9740 2.8278 2.9870 2.8330 3.0250 0.2483 2.9491 0.7349 0.1545 0.8346 0.8326 0.8461 0.8017 0.9163 0.8275 0.8543 0.8614 0.7137 0.6640 0.6467 0.6085
energy: 33417.5 33466.6 34513.5 36797.2 37409.4 38606.7 39111.6 39786.8 40386.8 40966.5 41142.2 41407.3 41545.3 42751.1 42768.9 43353.8 43557.7 44389.0 45188.1 45380.1 45467.0 45591.4 46103.1 46145.6 46406.5 46464.6 46716.7 46824.2 47251.9 47644.9 47788.2 48067.4 48448.0 48772.3 49039.6 49177.6 49223.2 49687.5 49905.0 50134.7 50189.5 50210.2 50499.5 50573.4 50972.6 51079.7 51342.9 51397.3 51621.4 51697.0 51748.5 51771.3 51913.2 52220.8 52910.2 52942.2 53018.5 53214.8 53572.2 53734.4 53894.1 54344.0 54376.3 54495.7 54719.5 54854.7 54874.8 54930.3 55014.2 55088.2 55116.3 55247.0 55277.5 55328.3 55555.0 55768.4 55840.2 55987.7 56064.4 56190.1 56466.7 56557.4 56616.9 56730.9 56836.4 57131.5 57186.0 57232.8 57289.3 57863.5 58030.3 58045.9 58132.7 58188.2 58457.8 58508.0 58637.7 58687.8 58762.4 58863.3 58890.9 58994.2 59109.7 59256.8 59298.0 59409.2 59519.5 59730.5 60027.3 60106.2 60187.1 60256.3 60438.7 60610.2 60635.1 60836.2 60978.7 61342.2 61395.7 61454.5 61537.5 61741.9 61862.4 61945.1 62174.5 62215.6 62252.9 62335.3 62514.3 62547.1 62594.9 62819.3 62846.1 62918.0 63134.9 63193.1 63234.1 63254.5 63296.4 63330.4 63530.5 63573.6 63774.8 63905.5 64013.6 64060.9 64070.9 64189.2 64268.8 64331.4 64419.4 64445.2 64519.5 64783.3 64837.9 64953.7 65058.2 65135.5 65212.1 65286.3 65363.5 65378.9 65430.6 65544.4 65687.7 65917.7 66199.4 66243.8 66305.1 66349.7 66381.2 66461.6 66523.7 66769.0 66805.3 66839.2 66925.8 66962.6 67046.2 67104.1 67194.4 67234.3 67272.2 67315.5 67374.7 67493.3 67540.2 67626.1 67722.7 67724.4 67792.1 67824.9 67881.1 68002.9 68038.6 68107.9 68193.1 68236.2 68352.6 68380.5
energy: -1662.575517877777
dipole: -2.12565 2.23379 0.10813 6.36974 -6.29127 0.07847 6.09717 -5.85687 0.24031
magnitude: 0.27495 au
magnitude: 0.69887 debye
