program: Orca
programVersion: 5.0.4
elementType: S S N N O O C C C C C N N C N C C N C C H H H H H H H H H H H H H H
keywords: PBE0 ma-def2-TZVP AutoAux D4 VeryTightSCF TightOPT
charge: 2
multiplicity: 1
formula: C10H14N6O2S2
InChI: InChI=1/C10H14N6O2S2/c1-2(3-5(11)13-9(19)15-7(3)17)4-6(12)14-10(20)16-8(4)18/h2,13-16H,1,11-12H3
34 atoms
S  3.682255 -1.769727 -4.131687
S  -5.633461 0.474028 -1.319559
N  0.317756 -3.877264 -1.099682
N  -1.069185 1.470926 0.421403
O  1.181376 0.819852 -0.834369
O  -2.222424 -2.996831 -0.848759
C  -0.221609 -1.438556 0.404486
C  0.398324 -0.83666 1.665102
C  -1.539736 -0.868502 -0.057204
C  -2.472939 -1.808193 -0.640772
C  -1.943473 0.415766 -0.016865
N  -3.7061 -1.317088 -0.983173
N  -3.174821 0.820986 -0.409484
C  -4.123343 -0.028009 -0.886795
N  1.876379 -2.732702 -2.454913
C  2.587401 -1.66271 -2.903607
C  1.001213 -2.652239 -1.427242
N  2.301509 -0.503494 -2.255242
C  0.740349 -1.51431 -0.752803
C  1.391449 -0.323791 -1.244012
H  0.416793 -4.58975 -1.828368
H  -0.714826 -3.655078 -0.969514
H  -0.104353 1.291039 -0.000988
H  -1.389073 2.393165 0.108905
H  -0.473964 -2.459203 0.693537
H  2.774001 0.331246 -2.586028
H  2.032884 -3.618673 -2.924718
H  -3.432251 1.800382 -0.339119
H  -4.366039 -1.985639 -1.365695
H  -0.992922 1.497095 1.444685
H  0.680222 -4.276087 -0.224832
H  0.909068 0.110992 1.507333
H  1.139277 -1.538984 2.048715
H  -0.370395 -0.707554 2.429457
totalener: -1663.73895304 hartree
nucrepener: 1912.04300984 hartree
electener: -3575.78196287 hartree
oneelecener: -6035.84882873 hartree
twoeener: 2460.06686586 hartree
cpcmener: -0.39020697 hartree
kineticenergy: 1658.57615401 hartree
exchangeener: -121.724019365294 hartree
correlationener: -5.703643248750 hartree
xcener: -127.427662614044 hartree
elementType: S N O C H
chargesum: 2.0000000
charge: -0.482362 -0.485394 -0.381246 -0.356976 -0.540191 -0.536509 -0.566124 -0.629055 0.458541 0.155979 -0.183905 -0.173155 -0.125174 0.218159 -0.105740 0.218429 -0.052490 -0.173553 1.084254 0.147174 0.381865 0.381802 0.365035 0.381898 0.236525 0.334674 0.344738 0.344852 0.333435 0.405505 0.404820 0.203003 0.187981 0.203208
charge: 0.226025 0.223452 0.177821 0.167260 -0.016796 -0.017512 -0.212682 -0.264916 -0.084718 -0.322391 -0.186914 0.157908 0.152684 -0.597952 0.154675 -0.596729 -0.180553 0.158831 -0.085243 -0.325032 0.269705 0.254867 0.250260 0.270742 0.238289 0.277912 0.279343 0.279049 0.277478 0.275460 0.278572 0.173125 0.172243 0.175737
qa: -0.4824 -0.4854 -0.3812 -0.3570 -0.5402 -0.5365 -0.5661 -0.6291 0.4585 0.1560 -0.1839 -0.1732 -0.1252 0.2182 -0.1057 0.2184 -0.0525 -0.1736 1.0843 0.1472 0.3819 0.3818 0.3650 0.3819 0.2365 0.3347 0.3447 0.3449 0.3334 0.4055 0.4048 0.2030 0.1880 0.2032
va: 1.7652 1.7622 3.4699 3.4229 1.8824 1.8307 4.8526 4.1833 3.4408 4.3635 4.5582 3.3609 3.2309 4.0261 3.2080 4.0057 4.4453 3.3558 1.3320 4.3420 0.8621 0.9022 0.9266 0.8628 0.9149 0.8954 0.8870 0.8871 0.8967 0.8291 0.8310 0.9422 0.9497 0.9356
energy: -1663.785307946373
dipole: 3.96730 -2.78739 1.17991 -1.66873 0.39216 -1.27657 13.63830 -9.18733 4.45097
magnitude: 4.77839 au
magnitude: 12.14569 debye
