program: Orca
programVersion: 5.0.4
elementType: S S N N O O C C C C C N N C N C C N C C H H H H H H H H
keywords: PBE0 aug-cc-pVDZ AutoAux D4 VeryTightSCF
charge: -4
multiplicity: 1
formula: C10H8N6O2S2
InChI: InChI=1/C10H8N6O2S2/c1-2(3-5(11)13-9(19)15-7(3)17)4-6(12)14-10(20)16-8(4)18/h2H,11-12H2,1H3
28 atoms
S  4.332241 -1.905657 -3.671648
S  -5.991537 0.286722 -0.462625
N  0.291813 -3.679855 -1.381938
N  -1.182445 1.466345 -0.015714
O  1.507242 0.891648 -0.701773
O  -2.39711 -3.139534 -0.365244
C  -0.233893 -1.36671 0.228791
C  0.306334 -0.757026 1.534219
C  -1.65283 -0.90842 -0.092012
C  -2.677603 -1.900458 -0.292659
C  -2.078114 0.410781 -0.148264
N  -3.984886 -1.502204 -0.396789
N  -3.364363 0.783651 -0.30173
C  -4.269491 -0.203964 -0.379327
N  2.088229 -2.708527 -2.450633
C  2.913542 -1.660467 -2.605974
C  1.083064 -2.545511 -1.571118
N  2.754085 -0.47382 -2.031258
C  0.837359 -1.377389 -0.860547
C  1.694604 -0.270245 -1.184334
H  0.384198 -4.285078 -2.183475
H  -0.680719 -3.507762 -1.093092
H  -0.212113 1.270539 -0.311686
H  -1.582233 2.297071 -0.425553
H  -0.389891 -2.42111 0.473412
H  0.595682 0.286383 1.417113
H  1.197647 -1.315847 1.851071
H  -0.456961 -0.830709 2.319525
totalener: -1659.87597856 hartree
nucrepener: 1733.47057902 hartree
electener: -3393.34655758 hartree
oneelecener: -5801.61626219 hartree
twoeener: 2408.26970461 hartree
kineticenergy: 1654.02806961 hartree
exchangeener: -120.921935654267 hartree
correlationener: -5.669067303506 hartree
xcener: -126.591002957772 hartree
chargesum: -4.0000000
charge: -0.879943 -0.881312 -0.117830 0.008828 -1.060719 -1.045021 0.000750 0.896096 0.922535 0.572067 -0.094611 -0.595053 -0.629294 0.046636 -0.602901 0.056003 -0.047174 -0.597386 0.974622 0.586693 -0.102259 -0.067363 -0.050504 -0.160911 -0.507060 -0.145980 -0.233223 -0.245689
charge: -0.094881 -0.098230 0.251170 0.253436 -0.021024 -0.036364 -0.183428 0.121947 -0.091407 -0.478751 -0.351110 -0.022595 -0.020015 -0.867826 -0.020646 -0.868086 -0.349388 -0.020101 -0.086266 -0.471824 -0.075540 -0.134126 -0.144546 -0.075260 -0.008918 -0.054770 -0.026771 -0.024682
qa: -0.8799 -0.8813 -0.1178 0.0088 -1.0607 -1.0450 0.0007 0.8961 0.9225 0.5721 -0.0946 -0.5951 -0.6293 0.0466 -0.6029 0.0560 -0.0472 -0.5974 0.9746 0.5867 -0.1023 -0.0674 -0.0505 -0.1609 -0.5071 -0.1460 -0.2332 -0.2457
va: 0.7252 0.7188 2.7221 2.6107 1.2495 1.2322 3.0439 3.6401 1.7245 1.1717 1.2479 2.0346 2.1784 2.9203 2.2466 2.9270 0.6255 1.9850 1.5698 1.3386 1.0204 1.0505 0.9412 1.0366 0.6960 0.7889 0.6416 0.6459
energy: 9511.9 11923.0 12410.4 12965.4 13110.1 13346.7 14712.2 15046.7 15134.6 15336.3 15428.3 15792.9 16086.7 16339.8 16589.1 16749.7 16773.2 16993.8 17045.4 17385.0 17701.5 18365.4 18890.8 19500.6 19539.0 19783.3 19919.7 20163.4 20252.3 20421.7 20604.5 20654.5 21110.8 21138.6 21323.1 21356.0 21724.3 21761.9 22017.3 22088.3 22375.5 22411.8 22696.6 22899.6 23181.5 23234.6 23341.6 23355.2 23567.4 23767.0 23852.9 24048.5 24290.1 24594.0 24641.8 24735.2 24814.2 24858.9 24897.9 24981.2 25412.1 25466.2 25722.4 25793.1 25862.7 25890.1 26077.3 26305.7 26485.5 26526.5 26575.3 26665.2 26746.6 26943.9 26963.4 27058.6 27349.1 27432.5 27648.3 27664.1 27816.7 27896.5 27995.3 28163.1 28466.3 28589.4 28625.6 28694.4 28802.7 28968.2 29113.2 29192.0 29323.2 29351.5 29492.7 29551.1 29629.5 29860.7 29961.0 30093.9 30320.0 30362.2 30512.6 30580.0 30729.1 30819.7 30898.6 30929.6 31111.8 31154.3 31197.6 31324.1 31537.2 31668.9 31778.8 31812.1 31888.9 31974.9 32269.5 32355.1 32454.1 32585.3 32905.6 33088.3 33167.6 33323.7 33409.4 33463.4 33541.9 33561.3 33788.5 33882.5 33905.7 33998.7 34087.2 34343.4 34474.8 34641.4 34734.8 34801.3 34875.4 34941.1 35056.3 35127.1 35143.9 35205.6 35290.2 35436.2 35458.2 35476.8 35576.0 35663.3 35707.0 35807.4 35845.6 36006.9 36028.5 36058.8 36452.4 36630.0 36729.3 36835.8 36900.3 36991.0 37004.0 37020.9 37085.1 37169.3 37230.1 37464.2 37536.3 37573.3 37673.2 37745.2 37842.3 37942.9 38033.4 38074.4 38229.9 38419.9 38501.9 38555.8 38662.0 38743.2 38855.3 38893.3 38919.5 38968.9 39029.0 39168.3 39273.3 39318.2 39426.9 39452.4 39507.5 39538.8 39620.9 39634.5 39712.3 39747.7
energy: -1659.877268518723
dipole: 2.96502 -2.12250 0.84252 -0.47052 0.05259 -0.41793 9.39798 -6.81831 2.57967
magnitude: 2.74576 au
magnitude: 6.97917 debye
