program: Orca
programVersion: 5.0.4
elementType: S S N N O O C C C C N N C N C C N C C H H H H H H H H H H H C C C C C C C H H H H H C H H
keywords: PBE0 aug-cc-pVDZ AutoAux D4 VeryTightSCF
charge: 2
multiplicity: 1
formula: C17H18N6O2S2
InChI: InChI=1/C17H18N6O2S2/c18-12-10(14(24)22-16(26)20-12)9(7-6-8-4-2-1-3-5-8)11-13(19)21-17(27)23-15(11)25/h1-7,9,20-23H,18-19H3
45 atoms
S  3.318451 -1.555613 -4.623896
S  -5.50861 0.48477 -0.469125
N  0.335201 -3.881353 -1.361164
N  -0.746263 1.300439 0.792266
O  1.294476 0.772238 -0.831859
O  -2.120613 -3.0431 -0.651286
C  0.054434 -1.561469 0.396568
C  -1.315634 -0.9720 0.16312
C  -2.3276 -1.867751 -0.34807
C  -1.692396 0.30557 0.367284
N  -3.584796 -1.3436 -0.494436
N  -2.955622 0.743393 0.171644
C  -3.966562 -0.060567 -0.254965
N  1.730442 -2.638709 -2.806325
C  2.389334 -1.537866 -3.262122
C  0.998738 -2.641021 -1.671286
N  2.195803 -0.428746 -2.499972
C  0.846975 -1.557178 -0.882571
C  1.437773 -0.329794 -1.361945
H  0.262489 -4.50143 -2.17437
H  -0.651634 -3.661817 -1.027102
H  0.144929 1.168526 0.221594
H  -1.086132 2.258302 0.653386
H  -0.145866 -2.601057 0.663513
H  2.6278 0.427861 -2.830846
H  1.82563 -3.487941 -3.355685
H  -3.185889 1.715821 0.34947
H  -4.303229 -1.972611 -0.837531
H  -0.511908 1.188101 1.787506
H  0.827931 -4.399625 -0.622143
C  0.524971 -1.168669 5.272052
C  1.066429 -0.726565 6.469279
C  1.012042 -0.704499 4.048171
C  2.052818 0.229694 4.054836
C  2.590373 0.672769 5.250118
C  2.101625 0.196451 6.462158
C  0.398233 -1.206609 2.822546
H  -0.288188 -1.887568 5.276923
H  0.675844 -1.100901 7.409077
H  2.525166 0.548974 7.395995
H  3.39438 1.400613 5.239584
H  2.438999 0.622852 3.12109
C  0.81458 -0.996398 1.574153
H  -0.497287 -1.80816 2.972452
H  1.717341 -0.431296 1.371845
elementType: S N O C H
totalener: -1932.38878924 hartree
nucrepener: 2759.50828161 hartree
electener: -4691.89707085 hartree
oneelecener: -8078.29523723 hartree
twoeener: 3386.39816638 hartree
cpcmener: -0.37372156 hartree
kineticenergy: 1924.97884051 hartree
exchangeener: -149.864787988184 hartree
correlationener: -7.255782217747 hartree
xcener: -157.120570205932 hartree
chargesum: 2.0000000
charge: -0.214452 -0.220905 -0.628359 -0.696634 -0.932196 -0.973784 0.957722 0.818217 0.758876 0.492676 -0.530253 -0.375001 0.478176 -0.433728 0.420892 0.826203 -0.445225 0.338091 0.458099 0.302425 0.180979 0.225668 0.305384 -0.408665 0.032212 0.011694 -0.001745 0.055179 0.354159 0.352947 0.371672 0.039276 2.098440 1.021809 -0.082047 0.607760 1.213021 -0.884772 -0.642483 -0.620901 -0.707160 -1.010899 1.483499 -1.280911 -1.114958
charge: 0.562268 0.557135 0.534427 0.527764 0.167274 0.162145 -0.098731 0.001426 -0.261573 -0.068117 0.182892 0.184510 -0.689754 0.184506 -0.690357 -0.062894 0.182957 -0.001037 -0.260170 0.119620 -0.052434 -0.056010 0.120923 0.059126 0.063914 0.076259 0.074699 0.063769 0.105383 0.133235 0.042543 0.004250 -0.187673 0.051093 0.005385 0.002214 0.052815 0.023013 0.015897 0.014912 0.016254 0.018063 0.054846 0.043501 0.019732
qa: -0.2145 -0.2209 -0.6284 -0.6966 -0.9322 -0.9738 0.9577 0.8182 0.7589 0.4927 -0.5303 -0.3750 0.4782 -0.4337 0.4209 0.8262 -0.4452 0.3381 0.4581 0.3024 0.1810 0.2257 0.3054 -0.4087 0.0322 0.0117 -0.0017 0.0552 0.3542 0.3529 0.3717 0.0393 2.0984 1.0218 -0.0820 0.6078 1.2130 -0.8848 -0.6425 -0.6209 -0.7072 -1.0109 1.4835 -1.2809 -1.1150
va: 1.7915 1.7814 2.8999 2.8154 1.3378 1.3830 -0.4975 1.3533 -0.3987 -3.2228 2.8329 2.5369 3.1104 2.6835 3.1477 -5.0982 2.8863 2.2399 1.4756 0.7170 1.0574 0.9583 0.6947 0.4402 0.8552 0.8570 0.8520 0.8425 0.7681 0.7788 -0.0762 3.4178 0.8242 -0.2365 2.2924 2.8578 0.5572 0.0449 0.4403 0.4433 0.4159 -0.2427 3.0582 -0.6226 -0.6951
energy: 29690.1 30010.9 30063.6 31398.7 32550.2 33630.6 33711.0 33994.4 35267.0 35670.8 36079.7 36134.9 36280.4 36757.4 37601.8 38572.0 38775.6 39038.0 40107.9 40408.0 40691.6 41094.9 41175.1 41393.8 41714.6 42540.9 43063.9 43258.1 43327.9 44018.4 44254.5 44662.5 44776.4 45188.8 45251.1 46567.9 47240.0 47271.7 47442.1 47696.5 47720.4 47800.2 48078.8 48308.5 48899.5 49544.2 49712.0 49776.9 49841.9 50477.1 50576.4 50734.8 51185.1 51285.1 51338.5 51704.4 51805.0 51841.6 51860.0 51910.1 51941.1 52023.7 52119.9 52228.7 52307.4 52352.0 52471.6 52566.8 52775.2 53048.7 53140.9 53193.0 53331.1 53419.2 53550.5 53643.9 53677.1 53949.2 54033.7 54053.7 54127.0 54354.2 54453.8 54518.0 54547.3 54618.1 54651.5 54922.2 55119.5 55212.4 55531.5 55686.7 55815.9 56024.9 56057.5 56080.4 56209.8 56248.7 56266.9 56345.0 56467.5 56523.8 56708.3 56819.8 56872.0 56957.5 57190.4 57250.7 57364.7 57468.8 57571.5 57681.9 57747.4 57789.8 57903.6 58083.5 58109.1 58146.7 58210.2 58363.9 58454.4 58510.8 58529.0 58652.2 58686.2 58715.4 58823.9 58934.9 59132.5 59235.1 59240.0 59265.8 59313.2 59453.9 59696.8 59719.8 59775.0 59806.6 59992.3 60157.5 60429.1 60554.0 60575.4 60627.7 60767.0 60862.4 60935.8 60979.3 61046.9 61065.4 61125.8 61153.7 61236.8 61371.1 61415.2 61512.0 61528.1 61554.2 61632.2 61708.5 61752.8 61934.9 62049.7 62117.6 62167.5 62182.6 62248.3 62310.1 62440.7 62496.1 62513.7 62589.0 62625.3 62668.3 62746.6 62767.2 62889.8 62902.9 62955.0 63027.7 63038.0 63203.1 63247.5 63253.7 63293.2 63395.9 63508.7 63601.5 63635.6 63674.4 63759.4 63819.5 63895.7 63956.7 64002.0 64045.8 64061.4 64113.4 64196.0 64222.9
energy: -1932.312661259071
dipole: 6.96243 -6.83815 0.12428 -1.17938 -0.93049 -2.10988 19.86252 -20.50618 -0.64366
magnitude: 2.20937 au
magnitude: 5.61578 debye
