program: Orca
programVersion: 5.0.4
elementType: S S N N O O C C C C N N C N C C N C C H H H H H H H H H C C C C C C C H H H H H C H H
keywords: PBE0 ma-def2-TZVP AutoAux D4 VeryTightSCF TightOPT
charge: 0
multiplicity: 1
formula: C17H16N6O2S2
InChI: InChI=1/C17H16N6O2S2/c18-12-10(14(24)22-16(26)20-12)9(7-6-8-4-2-1-3-5-8)11-13(19)21-17(27)23-15(11)25/h1-7,9,20-23H,18-19H2
43 atoms
S  3.85647 -4.028534 -3.055987
S  -5.687075 -0.792102 -0.160646
N  1.379735 -0.042872 -1.558424
N  -1.798628 -3.330202 1.471672
O  0.911334 -4.107249 0.854938
O  -1.116498 0.850525 -0.692925
C  0.205819 -1.329158 0.866156
C  -1.257974 -1.18656 0.520921
C  -1.769648 -0.077018 -0.192025
C  -2.149547 -2.183991 0.886751
N  -3.153731 -0.018061 -0.343942
N  -3.490906 -2.017031 0.663534
C  -4.042942 -0.939241 0.063989
N  2.461975 -1.987274 -2.112839
C  2.805179 -3.28908 -1.995829
C  1.604476 -1.322616 -1.273657
N  2.222142 -3.928634 -0.966194
C  1.057535 -1.991563 -0.192544
C  1.353172 -3.364439 -0.037694
H  2.862687 -1.485708 -2.895272
H  -4.129417 -2.751522 0.941631
H  1.761306 0.349866 -2.406048
H  0.557328 0.41467 -1.153714
H  -0.832474 -3.651087 1.40253
H  -2.503087 -4.031342 1.64537
H  2.437622 -4.910013 -0.844278
H  -3.513512 0.795579 -0.826567
H  0.244425 -2.04447 1.696175
C  0.03114 3.003159 3.313327
C  0.561956 4.117054 3.946466
C  0.85764 2.026717 2.751038
C  2.242562 2.203001 2.847313
C  2.772747 3.314589 3.47845
C  1.936757 4.279317 4.03099
C  0.233466 0.879996 2.092671
H  -1.045723 2.880566 3.249136
H  -0.102092 4.860664 4.374273
H  2.356939 5.148364 4.525303
H  3.849535 3.430935 3.542535
H  2.916035 1.46346 2.428719
C  0.860693 -0.10199 1.449284
H  -0.853156 0.864398 2.14405
H  1.945727 -0.108762 1.387442
totalener: -1931.82086939 hartree
nucrepener: 2698.71373544 hartree
electener: -4630.53460484 hartree
oneelecener: -8011.22512623 hartree
twoeener: 3380.69052140 hartree
cpcmener: -0.07015241 hartree
kineticenergy: 1925.49306275 hartree
exchangeener: -149.815370225986 hartree
correlationener: -7.238795617703 hartree
xcener: -157.054165843690 hartree
elementType: S N O C H
chargesum: 0.0000000
charge: -0.561964 -0.560638 -0.494336 -0.564453 -0.652344 -0.585406 -1.142378 1.311371 0.388449 0.129928 -0.202817 -0.167295 0.191825 -0.172431 0.166202 0.127066 -0.224505 -0.259223 0.312742 0.321654 0.322255 0.323257 0.333132 0.329590 0.326360 0.319321 0.320744 0.170010 -0.130682 -0.053763 -0.558090 -0.178670 -0.047411 -0.102816 0.302439 0.177613 0.175061 0.175100 0.177469 0.174567 -0.296998 0.196789 0.183276
charge: 0.142686 0.143687 0.013224 0.007732 -0.104570 -0.086032 -0.184641 -0.130385 -0.379067 -0.254483 0.128098 0.131829 -0.615044 0.131993 -0.612758 -0.259432 0.128122 -0.132437 -0.373617 0.268330 0.268598 0.230918 0.228541 0.224348 0.230355 0.267182 0.267963 0.243827 -0.141946 -0.177957 -0.195366 -0.136853 -0.176478 -0.180965 -0.151783 0.195006 0.187102 0.185719 0.187176 0.194905 -0.135573 0.213184 0.208863
qa: -0.5620 -0.5606 -0.4943 -0.5645 -0.6523 -0.5854 -1.1424 1.3114 0.3884 0.1299 -0.2028 -0.1673 0.1918 -0.1724 0.1662 0.1271 -0.2245 -0.2592 0.3127 0.3217 0.3223 0.3233 0.3331 0.3296 0.3264 0.3193 0.3207 0.1700 -0.1307 -0.0538 -0.5581 -0.1787 -0.0474 -0.1028 0.3024 0.1776 0.1751 0.1751 0.1775 0.1746 -0.2970 0.1968 0.1833
va: 1.6567 1.6563 2.9862 3.0834 1.6947 1.6973 3.7249 -1.5224 4.1006 4.3135 3.2662 3.1949 4.0304 3.2086 4.0790 4.3820 3.2808 3.6626 3.9858 0.9055 0.9032 0.9114 0.9282 0.9223 0.9100 0.9063 0.9050 0.9524 3.9668 3.9562 4.5225 4.1711 4.0434 3.9005 3.0737 0.9522 0.9519 0.9533 0.9494 0.9587 4.8984 0.9300 0.9471
energy: -1931.880176064476
dipole: 5.68039 -5.54351 0.13688 13.00953 -12.94768 0.06185 12.48375 -11.99900 0.48475
magnitude: 0.50749 au
magnitude: 1.28993 debye
