program: Orca
programVersion: 5.0.4
elementType: S S N N O O C C C C N N C N C C N C C H H H H H H H H H H H C C C C C C C H H H H H C H H
keywords: PBE0 ma-def2-TZVP AutoAux D4 VeryTightSCF TightOPT
charge: 2
multiplicity: 1
formula: C17H18N6O2S2
InChI: InChI=1/C17H18N6O2S2/c18-12-10(14(24)22-16(26)20-12)9(7-6-8-4-2-1-3-5-8)11-13(19)21-17(27)23-15(11)25/h1-7,9,20-23H,18-19H3
45 atoms
S  3.318451 -1.555613 -4.623896
S  -5.50861 0.48477 -0.469125
N  0.335201 -3.881353 -1.361164
N  -0.746263 1.300439 0.792266
O  1.294476 0.772238 -0.831859
O  -2.120613 -3.0431 -0.651286
C  0.054434 -1.561469 0.396568
C  -1.315634 -0.9720 0.16312
C  -2.3276 -1.867751 -0.34807
C  -1.692396 0.30557 0.367284
N  -3.584796 -1.3436 -0.494436
N  -2.955622 0.743393 0.171644
C  -3.966562 -0.060567 -0.254965
N  1.730442 -2.638709 -2.806325
C  2.389334 -1.537866 -3.262122
C  0.998738 -2.641021 -1.671286
N  2.195803 -0.428746 -2.499972
C  0.846975 -1.557178 -0.882571
C  1.437773 -0.329794 -1.361945
H  0.262489 -4.50143 -2.17437
H  -0.651634 -3.661817 -1.027102
H  0.144929 1.168526 0.221594
H  -1.086132 2.258302 0.653386
H  -0.145866 -2.601057 0.663513
H  2.6278 0.427861 -2.830846
H  1.82563 -3.487941 -3.355685
H  -3.185889 1.715821 0.34947
H  -4.303229 -1.972611 -0.837531
H  -0.511908 1.188101 1.787506
H  0.827931 -4.399625 -0.622143
C  0.524971 -1.168669 5.272052
C  1.066429 -0.726565 6.469279
C  1.012042 -0.704499 4.048171
C  2.052818 0.229694 4.054836
C  2.590373 0.672769 5.250118
C  2.101625 0.196451 6.462158
C  0.398233 -1.206609 2.822546
H  -0.288188 -1.887568 5.276923
H  0.675844 -1.100901 7.409077
H  2.525166 0.548974 7.395995
H  3.39438 1.400613 5.239584
H  2.438999 0.622852 3.12109
C  0.81458 -0.996398 1.574153
H  -0.497287 -1.80816 2.972452
H  1.717341 -0.431296 1.371845
totalener: -1932.66257114 hartree
nucrepener: 2760.59681369 hartree
electener: -4693.25938483 hartree
oneelecener: -8081.92172049 hartree
twoeener: 3388.66233566 hartree
cpcmener: -0.37386383 hartree
kineticenergy: 1926.11830228 hartree
exchangeener: -149.932930513252 hartree
correlationener: -7.240621974671 hartree
xcener: -157.173552487923 hartree
elementType: S N O C H
chargesum: 2.0000000
charge: -0.466066 -0.473749 -0.364187 -0.364748 -0.478497 -0.470274 -1.275937 0.737039 0.119650 -0.213202 -0.173212 -0.132959 0.188276 -0.124959 0.182371 -0.034742 -0.154207 1.564488 0.039195 0.388768 0.346886 0.362640 0.389027 0.265276 0.333552 0.346968 0.345705 0.332282 0.409342 0.407720 -0.275620 -0.013036 -0.531929 0.060423 -0.154577 -0.053333 0.685055 0.182945 0.178386 0.178096 0.180163 0.184220 -1.057185 0.187763 0.216181
charge: 0.235995 0.230968 0.177149 0.171265 0.000096 -0.003837 -0.175562 -0.083520 -0.330809 -0.187507 0.159243 0.156955 -0.594503 0.156356 -0.594907 -0.179802 0.159257 -0.079840 -0.331277 0.272234 0.247763 0.249735 0.271919 0.249082 0.277836 0.280824 0.280160 0.277388 0.278172 0.279536 -0.132802 -0.171306 -0.196014 -0.129658 -0.170036 -0.169140 -0.124360 0.196502 0.188480 0.187573 0.188584 0.198032 -0.147750 0.216483 0.215045
qa: -0.4661 -0.4737 -0.3642 -0.3647 -0.4785 -0.4703 -1.2759 0.7370 0.1197 -0.2132 -0.1732 -0.1330 0.1883 -0.1250 0.1824 -0.0347 -0.1542 1.5645 0.0392 0.3888 0.3469 0.3626 0.3890 0.2653 0.3336 0.3470 0.3457 0.3323 0.4093 0.4077 -0.2756 -0.0130 -0.5319 0.0604 -0.1546 -0.0533 0.6851 0.1829 0.1784 0.1781 0.1802 0.1842 -1.0572 0.1878 0.2162
va: 1.7852 1.7737 3.3892 3.4150 1.9492 1.9246 7.0218 3.1375 4.1418 4.6341 3.2862 3.2306 4.0383 3.2016 4.0368 4.2963 3.3339 -1.0685 4.4970 0.8565 0.9453 0.9270 0.8554 0.9000 0.8965 0.8858 0.8875 0.8979 0.8250 0.8300 4.1763 3.8922 4.4079 3.8606 4.1453 3.8551 2.6797 0.9481 0.9509 0.9518 0.9494 0.9484 5.5651 0.9566 0.9370
energy: -1932.721974989103
dipole: 6.96243 -6.85342 0.10902 -1.17938 -0.91788 -2.09726 19.86252 -20.54289 -0.68037
magnitude: 2.20755 au
magnitude: 5.61116 debye
