program: Orca
programVersion: 5.0.4
elementType: S S N N O O C C C C N N C N C C N C C H H H H H H H H H C C C C C C C H H H H H C H H
keywords: PBE0 aug-cc-pVDZ AutoAux D4 VeryTightSCF
charge: 0
multiplicity: 1
formula: C17H16N6O2S2
InChI: InChI=1/C17H16N6O2S2/c18-12-10(14(24)22-16(26)20-12)9(7-6-8-4-2-1-3-5-8)11-13(19)21-17(27)23-15(11)25/h1-7,9,20-23H,18-19H2
43 atoms
S  -3.85708 -4.02476 -3.06805
S  5.68508 -0.7790 -0.12422
N  -1.41407 -0.02721 -1.5286
N  1.78999 -3.31987 1.50405
O  -0.86466 -4.1242 0.80956
O  1.10541 0.81657 -0.73958
C  -0.21173 -1.33403 0.86402
C  1.2521 -1.19105 0.52374
C  1.75794 -0.0873 -0.21045
C  2.14425 -2.17765 0.90786
N  3.14793 -0.02234 -0.34275
N  3.48715 -2.00645 0.69337
C  4.03704 -0.93271 0.08613
N  -2.47748 -1.98062 -2.10781
C  -2.80351 -3.28732 -2.00477
C  -1.62225 -1.31642 -1.26486
N  -2.20462 -3.93496 -0.99052
C  -1.0601 -1.99249 -0.19852
C  -1.32873 -3.37664 -0.05951
H  -2.88913 -1.47366 -2.88086
H  4.12675 -2.73462 0.98471
H  -1.79714 0.36796 -2.37454
H  -0.57131 0.41449 -1.14308
H  0.82889 -3.65136 1.39856
H  2.49604 -4.0188 1.68055
H  -2.40692 -4.92069 -0.88587
H  3.51083 0.78355 -0.83505
H  -0.2526 -2.0530 1.69079
C  -0.02167 3.00406 3.29713
C  -0.54843 4.11541 3.9381
C  -0.8515 2.02842 2.73823
C  -2.23584 2.20411 2.84482
C  -2.76204 3.31317 3.48367
C  -1.92266 4.2764 4.03374
C  -0.23142 0.88282 2.07428
H  1.05464 2.88195 3.22465
H  0.11825 4.85785 4.36354
H  -2.33965 5.14326 4.53425
H  -3.83828 3.42883 3.5556
H  -2.91177 1.46612 2.42763
C  -0.86373 -0.10794 1.45033
H  0.8556 0.87505 2.10585
H  -1.94956 -0.12258 1.40995
elementType: S N O C H
totalener: -1931.54658484 hartree
nucrepener: 2699.23645542 hartree
electener: -4630.78304027 hartree
oneelecener: -8010.68293586 hartree
twoeener: 3379.89989559 hartree
cpcmener: -0.06020792 hartree
kineticenergy: 1924.34454700 hartree
exchangeener: -149.741568432640 hartree
correlationener: -7.253926409417 hartree
xcener: -156.995494842057 hartree
chargesum: -0.0000000
charge: -0.310007 -0.314586 -0.077933 -0.153752 -0.932760 -0.972843 0.407817 1.059535 0.428372 0.496408 -0.393925 -0.474962 0.413135 -0.371704 0.486121 -0.246344 -0.478670 1.341891 0.721272 -0.009130 0.019211 -0.030753 0.021455 -0.037561 -0.010480 0.019222 -0.001063 -0.541030 0.659644 -0.117950 1.902524 1.116645 -0.133418 0.635630 1.148528 -0.928216 -0.646649 -0.621219 -0.727471 -0.893760 0.822064 -1.079573 -1.193719
charge: 0.464513 0.465657 0.365674 0.365293 0.097233 0.114160 -0.117494 -0.041800 -0.332712 -0.181051 0.155347 0.164375 -0.716946 0.164441 -0.715054 -0.187723 0.153734 -0.045286 -0.332540 0.053250 0.053852 0.029424 -0.102698 -0.095619 0.029246 0.044578 0.044068 0.037660 0.035090 -0.003945 -0.193365 0.043781 -0.002475 -0.007395 0.028720 0.019808 0.013666 0.011498 0.014082 0.012984 0.052571 0.016968 0.024428
qa: -0.3100 -0.3146 -0.0779 -0.1538 -0.9328 -0.9728 0.4078 1.0595 0.4284 0.4964 -0.3939 -0.4750 0.4131 -0.3717 0.4861 -0.2463 -0.4787 1.3419 0.7213 -0.0091 0.0192 -0.0308 0.0215 -0.0376 -0.0105 0.0192 -0.0011 -0.5410 0.6596 -0.1179 1.9025 1.1166 -0.1334 0.6356 1.1485 -0.9282 -0.6466 -0.6212 -0.7275 -0.8938 0.8221 -1.0796 -1.1937
va: 1.6805 1.6792 2.9929 2.9795 1.3398 1.4133 2.9934 2.1991 1.6695 -1.7752 2.6963 2.7642 3.1304 2.6586 2.9690 0.6152 2.8041 1.1430 -0.1946 0.8416 0.8357 0.8557 0.8804 0.9852 0.8345 0.8585 0.8720 0.6096 -0.6057 3.4070 0.6057 -0.6465 2.5907 2.8648 1.8035 -0.0308 0.4548 0.4437 0.4281 -0.1907 4.1511 -0.6080 -0.6720
energy: 33318.9 33377.1 33700.9 35243.2 36225.8 36380.3 36878.5 38040.2 38183.9 38893.0 39123.8 39506.5 40142.8 40451.5 40642.7 40956.0 41183.6 41269.2 41455.6 41698.3 41810.1 42082.7 42644.9 42817.7 42879.4 42905.9 42959.1 43070.4 43953.0 44053.8 45013.3 45197.0 45279.3 45536.4 45635.4 45877.5 46037.6 46143.6 46227.6 46273.2 46314.0 46337.8 46678.4 46912.4 46965.6 47010.4 47291.2 47319.6 47382.4 47863.6 47975.0 48086.6 48234.7 48571.4 48657.5 48818.0 48847.5 48917.7 49027.2 49136.0 49218.2 49513.0 49641.6 49718.7 49847.6 49956.3 50007.6 50062.1 50104.9 50135.2 50247.8 50407.6 50611.5 50613.6 50790.0 50995.8 51061.3 51159.5 51170.9 51341.5 51385.3 51481.3 51755.8 51768.6 51991.6 52028.1 52128.9 52137.3 52191.1 52197.3 52268.3 52542.1 52765.6 52824.8 53032.0 53199.9 53244.0 53299.6 53437.6 53525.2 53627.1 53737.7 53766.5 53824.0 53914.8 53949.1 54070.1 54174.3 54208.6 54355.6 54428.7 54480.5 54616.1 54662.4 54701.2 54741.1 54877.6 54933.9 54985.6 55019.7 55084.5 55110.7 55118.0 55149.4 55215.1 55297.0 55321.7 55395.4 55473.2 55539.0 55541.9 55598.5 55667.4 55751.5 55824.6 55867.9 56073.9 56155.2 56212.1 56292.3 56349.8 56584.3 56798.8 56924.0 57095.2 57269.3 57346.1 57367.3 57471.3 57519.5 57543.7 57659.3 57706.1 57838.9 57905.1 57965.2 58019.0 58138.3 58154.9 58192.2 58228.3 58258.9 58336.5 58389.0 58442.1 58471.7 58526.8 58564.2 58580.7 58644.8 58697.8 58776.7 58807.8 58856.0 58935.4 59020.7 59072.1 59119.3 59268.1 59323.0 59419.3 59448.4 59639.0 59703.4 59734.0 59795.2 59919.7 59976.9 60085.8 60138.3 60299.2 60333.9 60412.8 60431.1 60508.5 60526.0 60600.6 60609.7 60684.6 60724.0
energy: -1931.454080874345
dipole: -5.69751 5.46595 -0.23155 13.02628 -12.87817 0.14811 12.53332 -11.90872 0.62460
magnitude: 0.68240 au
magnitude: 1.73453 debye
