program: Orca
programVersion: 5.0.4
elementType: S S N N O O C C C C N N C N C C N C C H H H H H C C C C C C C H H H H H C H H
keywords: PBE0 ma-def2-TZVP AutoAux D4 VeryTightSCF TightOPT
charge: -4
multiplicity: 1
formula: C17H12N6O2S2
InChI: InChI=1/C17H12N6O2S2/c18-12-10(14(24)22-16(26)20-12)9(7-6-8-4-2-1-3-5-8)11-13(19)21-17(27)23-15(11)25/h1-7,9H,18-19H2
39 atoms
S  3.633037 -1.151547 -4.18071
S  -5.933419 -0.157823 -0.578407
N  0.171995 -3.480136 -1.519355
N  -1.261416 1.318196 0.076783
O  1.481232 0.912509 -0.253953
O  -2.216793 -3.336712 0.028022
C  -0.169004 -1.411397 0.443891
C  -1.612334 -1.063077 0.165525
C  -2.562376 -2.116452 0.001152
C  -2.084781 0.233167 -0.015843
N  -3.877288 -1.804567 -0.202748
N  -3.381826 0.512998 -0.262314
C  -4.232078 -0.52372 -0.319656
N  1.739235 -2.287247 -2.702279
C  2.495258 -1.185589 -2.83863
C  0.894702 -2.321349 -1.654038
N  2.436969 -0.123873 -2.034309
C  0.773221 -1.282554 -0.737032
C  1.563772 -0.121988 -0.981566
H  0.168957 -4.061783 -2.342517
H  -0.700585 -3.4627 -0.978107
H  -0.242844 1.183838 0.008419
H  -1.637134 2.16576 -0.317982
H  -0.207837 -2.48891 0.661125
C  -0.641078 0.722389 4.920583
C  -0.19669 1.187845 6.149017
C  0.234334 0.129851 4.003766
C  1.581489 0.02013 4.371974
C  2.025943 0.484116 5.597851
C  1.141375 1.071175 6.496823
C  -0.296814 -0.340866 2.727281
H  -1.689957 0.817355 4.656066
H  -0.90083 1.64285 6.837888
H  1.493506 1.43123 7.45718
H  3.074336 0.3835 5.858997
H  2.291059 -0.439896 3.693021
C  0.404844 -0.835653 1.705624
H  -1.374839 -0.24898 2.615365
H  1.485349 -0.921608 1.787554
totalener: -1929.84786157 hartree
nucrepener: 2602.89058399 hartree
electener: -4532.73844556 hartree
oneelecener: -7916.32231411 hartree
twoeener: 3383.58386855 hartree
cpcmener: -0.87196397 hartree
kineticenergy: 1923.39581175 hartree
exchangeener: -149.336341530052 hartree
correlationener: -7.221386935740 hartree
xcener: -156.557728465792 hartree
elementType: S N O C H
chargesum: -4.0000000
charge: -0.952897 -0.952079 -0.657225 -0.638996 -0.712523 -0.773685 -0.715295 1.064762 0.338417 0.071515 -0.753148 -0.710104 0.401947 -0.713462 0.480937 0.003361 -0.701444 0.323341 0.354835 0.280754 0.301821 0.315597 0.279530 0.144903 -0.132314 -0.100816 -0.511772 -0.151441 -0.085416 -0.084339 0.601759 0.175727 0.172069 0.172275 0.173838 0.174717 -0.808582 0.183397 0.140034
charge: -0.229540 -0.229379 -0.121242 -0.105610 -0.182815 -0.204573 -0.217256 -0.183695 -0.463187 -0.363468 -0.090386 -0.091999 -0.694539 -0.092279 -0.691807 -0.356396 -0.085596 -0.180027 -0.462126 0.205804 0.208886 0.216034 0.206626 0.236355 -0.151745 -0.185620 -0.200358 -0.146527 -0.184168 -0.194296 -0.188383 0.193241 0.185635 0.183651 0.185739 0.193497 -0.127973 0.207229 0.202292
qa: -0.9529 -0.9521 -0.6572 -0.6390 -0.7125 -0.7737 -0.7153 1.0648 0.3384 0.0715 -0.7531 -0.7101 0.4019 -0.7135 0.4809 0.0034 -0.7014 0.3233 0.3548 0.2808 0.3018 0.3156 0.2795 0.1449 -0.1323 -0.1008 -0.5118 -0.1514 -0.0854 -0.0843 0.6018 0.1757 0.1721 0.1723 0.1738 0.1747 -0.8086 0.1834 0.1400
va: 1.0730 1.0726 2.8928 2.7527 1.6098 1.6101 3.5215 -1.2617 3.9422 4.2585 2.5311 2.5811 3.6231 2.6157 3.4825 4.2445 2.5736 2.1673 3.8636 0.9375 0.9517 0.9460 0.9366 0.9646 3.9452 4.0266 4.4427 4.1163 4.0922 3.8375 1.7660 0.9522 0.9529 0.9543 0.9508 0.9577 5.1716 0.9385 0.9639
energy: -1929.912530238100
dipole: 5.95477 -2.56112 3.39365 3.46979 -1.90392 1.56588 24.15867 -11.50857 12.65009
magnitude: 13.19066 au
magnitude: 33.52801 debye
