program: Orca
programVersion: 5.0.4
elementType: S S N N O O C C C C N N C N C C N C C H H H H H C C C C C C C H H H H H C H H
keywords: PBE0 aug-cc-pVDZ AutoAux D4 VeryTightSCF
charge: -4
multiplicity: 1
formula: C17H12N6O2S2
InChI: InChI=1/C17H12N6O2S2/c18-12-10(14(24)22-16(26)20-12)9(7-6-8-4-2-1-3-5-8)11-13(19)21-17(27)23-15(11)25/h1-7,9H,18-19H2
39 atoms
S  3.850203 -1.494587 -3.944953
S  -5.936127 0.067296 -0.683737
N  0.131186 -3.563337 -1.421758
N  -1.232012 1.391667 0.05021
O  1.51019 0.839053 -0.259417
O  -2.321522 -3.239211 -0.025527
C  -0.232078 -1.374955 0.437271
C  -1.654939 -0.982916 0.102563
C  -2.64637 -2.013186 -0.076768
C  -2.093774 0.334896 -0.074537
N  -3.942857 -1.659693 -0.293036
N  -3.368779 0.650775 -0.334293
C  -4.249109 -0.36799 -0.407191
N  1.799964 -2.469286 -2.564984
C  2.611597 -1.397958 -2.69135
C  0.895893 -2.425445 -1.581108
N  2.547245 -0.295114 -1.947129
C  0.746765 -1.334809 -0.721707
C  1.606438 -0.211331 -0.96573
H  0.150134 -4.12912 -2.254752
H  -0.786365 -3.472391 -0.962333
H  -0.220212 1.226981 -0.049981
H  -1.603178 2.233535 -0.35672
H  -0.328573 -2.441077 0.700762
C  -0.616822 0.26414 5.11286
C  -0.132221 0.677131 6.34249
C  0.206706 0.156046 3.981308
C  1.554229 0.520701 4.1503
C  2.036691 0.92991 5.381622
C  1.206612 1.009866 6.496614
C  -0.358448 -0.308253 2.725661
H  -1.66687 0.008092 5.004815
H  -0.806566 0.742076 7.192785
H  1.593536 1.333879 7.457165
H  3.084097 1.207708 5.474502
H  2.212107 0.501276 3.288387
C  0.341301 -0.766571 1.679269
H  -1.443623 -0.297382 2.648685
H  1.426241 -0.801938 1.734203
totalener: -1928.77121520 hartree
nucrepener: 2591.79470563 hartree
electener: -4520.56592084 hartree
oneelecener: -7880.09438572 hartree
twoeener: 3359.52846488 hartree
kineticenergy: 1921.77661590 hartree
exchangeener: -149.099742973593 hartree
correlationener: -7.207662901050 hartree
xcener: -156.307405874643 hartree
chargesum: -4.0000000
charge: -0.699449 -0.676189 -0.110955 -0.162859 -1.061840 -1.030255 0.396143 0.543375 0.652140 0.133174 -0.597830 -0.541799 -0.060099 -0.589603 0.022456 -0.173909 -0.634644 1.297121 0.867105 -0.073897 -0.093731 -0.023078 -0.101644 -0.433496 1.683095 -0.260492 2.247661 1.848266 -0.703061 0.802298 1.180892 -0.834182 -1.309171 -2.868031 -0.906251 -0.830906 1.374803 -1.117306 -1.153854
charge: 0.055775 0.068445 0.275656 0.290480 0.018748 -0.002374 -0.153826 -0.059149 -0.461321 -0.334766 -0.007671 0.001962 -0.862154 -0.003221 -0.861399 -0.334387 -0.004362 -0.058929 -0.463650 -0.056599 -0.139873 -0.131591 -0.050514 0.024984 0.020013 -0.052525 -0.185636 0.040791 -0.039197 -0.074451 0.027330 0.004998 -0.126931 -0.382230 -0.055232 0.007519 0.043439 0.011726 0.010124
qa: -0.6994 -0.6762 -0.1110 -0.1629 -1.0618 -1.0303 0.3961 0.5434 0.6521 0.1332 -0.5978 -0.5418 -0.0601 -0.5896 0.0225 -0.1739 -0.6346 1.2971 0.8671 -0.0739 -0.0937 -0.0231 -0.1016 -0.4335 1.6831 -0.2605 2.2477 1.8483 -0.7031 0.8023 1.1809 -0.8342 -1.3092 -2.8680 -0.9063 -0.8309 1.3748 -1.1173 -1.1539
va: 1.1536 1.1958 2.7670 2.8589 1.3790 1.2502 4.4556 3.7068 0.9203 1.0358 2.0758 2.1010 3.1629 2.1911 3.0628 0.2005 2.0690 0.9786 0.9573 0.9555 1.0937 0.9252 0.9490 0.6993 -2.1064 3.4725 0.3638 -2.0488 4.0026 2.4601 2.0241 -0.0206 1.2459 -0.3571 0.7863 -0.1445 3.7712 -0.4405 -0.6300
energy: 2721.9 3041.4 3854.0 6206.8 7600.2 8429.8 8629.1 9002.5 9097.5 9446.0 10919.2 11053.5 11763.2 12052.5 12272.5 12411.1 12515.0 13011.6 13059.1 13968.8 14046.9 14149.4 14262.9 14845.2 16449.3 16581.5 16700.4 17297.6 17393.2 17814.3 17893.0 18199.3 18449.0 18806.2 19161.4 19249.3 19415.5 19473.8 19648.2 19681.6 19692.2 20048.6 20165.9 20318.0 20458.2 20823.7 20911.2 20933.2 21153.4 21255.1 21277.3 21551.7 21628.9 21708.0 21712.4 21747.6 21883.4 21986.4 22097.4 22277.8 22707.3 22802.7 22874.6 23055.6 23071.4 23241.3 23507.6 23778.1 24011.3 24030.1 24173.1 24264.3 24304.6 24490.8 24936.8 25082.7 25148.0 25372.7 25444.6 25502.1 25751.3 25890.9 26247.7 26355.8 26554.6 26598.0 26702.1 26713.7 26763.1 27042.7 27185.6 27300.8 27437.9 27616.8 27766.2 27826.7 27895.3 27964.9 28031.9 28127.8 28208.7 28336.5 28520.3 28570.7 28707.7 28731.7 28864.7 28894.4 28976.0 28987.6 29104.4 29268.6 29310.6 29335.9 29396.6 29509.7 29622.0 29649.9 29790.6 29835.1 29855.3 29887.4 29984.9 30007.6 30157.6 30248.1 30340.8 30431.6 30475.6 30569.1 30606.4 30702.6 30766.9 30794.9 30926.1 31074.7 31080.5 31163.5 31212.9 31328.4 31334.0 31380.6 31404.3 31467.1 31507.1 31590.6 31633.5 31745.5 31769.2 31840.4 31897.4 31907.2 31990.8 32019.3 32047.7 32147.6 32191.7 32327.0 32367.2 32443.3 32489.7 32520.5 32595.3 32641.8 32677.4 32789.4 32860.4 32926.8 33011.3 33095.2 33140.3 33190.1 33305.1 33315.3 33377.3 33547.6 33586.6 33738.6 33758.5 33993.8 34086.4 34119.0 34168.6 34198.9 34290.7 34318.7 34385.7 34413.4 34459.4 34602.9 34627.3 34759.1 34768.8 34881.5 34950.0 34955.7 35139.9 35252.0 35342.5 35430.1
energy: -1928.820766235326
dipole: 5.64271 -5.88230 -0.23959 3.68093 -5.31352 -1.63259 24.00519 -25.21915 -1.21396
magnitude: 2.04852 au
magnitude: 5.20693 debye
