program: Orca
programVersion: 5.0.4
elementType: S S N N O O C C C C N N C N C C N C C H H H H H H H H H C C C C C C C H H H H H C H H
keywords: PBE0 ma-def2-TZVP AutoAux D4 VeryTightSCF TightOPT
charge: 0
multiplicity: 1
formula: C17H16N6O2S2
InChI: InChI=1/C17H16N6O2S2/c18-12-10(14(24)22-16(26)20-12)9(7-6-8-4-2-1-3-5-8)11-13(19)21-17(27)23-15(11)25/h1-7,9,20-23H,18-19H2
43 atoms
S  3.832715 -3.97448 -3.108537
S  -5.675261 -0.796637 -0.080499
N  1.453322 0.02003 -1.462587
N  -1.778262 -3.340132 1.546441
O  0.789079 -4.143089 0.723793
O  -1.091952 0.766186 -0.7470
C  0.217904 -1.350372 0.88422
C  -1.2475 -1.216263 0.552666
C  -1.750499 -0.118821 -0.203598
C  -2.137897 -2.19511 0.940579
N  -3.138834 -0.046669 -0.332485
N  -3.480981 -2.022204 0.726194
C  -4.044865 -0.944766 0.110766
N  2.481716 -1.943665 -2.099767
C  2.793593 -3.269218 -2.040713
C  1.636722 -1.287023 -1.239683
N  2.162422 -3.929836 -1.044562
C  1.057544 -1.982485 -0.200431
C  1.288497 -3.382392 -0.109241
H  2.922312 -1.446903 -2.858442
H  -4.140752 -2.724026 1.023426
H  1.825397 0.429223 -2.301781
H  0.598482 0.451134 -1.083493
H  -0.823901 -3.685817 1.389715
H  -2.479407 -4.041866 1.707474
H  2.343764 -4.919878 -0.967971
H  -3.496607 0.749951 -0.839107
H  0.272369 -2.085495 1.695672
C  0.02484 3.042929 3.222412
C  0.552266 4.156395 3.856208
C  0.850361 2.033464 2.725663
C  2.231026 2.176357 2.888577
C  2.75959 3.286853 3.51943
C  1.923577 4.284127 4.007108
C  0.233237 0.885935 2.065197
H  -1.049727 2.947656 3.105113
H  -0.111131 4.926523 4.233051
H  2.341377 5.152377 4.50325
H  3.833746 3.376364 3.636647
H  2.9020 1.407751 2.523343
C  0.86384 -0.124316 1.475448
H  -0.853761 0.891125 2.066998
H  1.949628 -0.150577 1.456587
totalener: -1931.76169591 hartree
nucrepener: 2698.71373544 hartree
electener: -4630.47543135 hartree
oneelecener: -8011.79334066 hartree
twoeener: 3381.31790931 hartree
kineticenergy: 1925.53956314 hartree
exchangeener: -149.818213632940 hartree
correlationener: -7.238356641626 hartree
xcener: -157.056570274565 hartree
chargesum: -0.0000000
charge: -0.423570 -0.423555 -0.399962 -0.459202 -0.523658 -0.460989 -0.550454 0.951836 0.306825 0.189777 -0.162348 -0.170274 0.096967 -0.173835 0.069959 0.122016 -0.179202 -0.543972 0.318389 0.248212 0.247071 0.240747 0.335447 0.324541 0.243166 0.271212 0.273320 0.157687 -0.118537 -0.044127 -0.304262 -0.100838 -0.048543 -0.063948 0.275402 0.127658 0.128456 0.127952 0.129225 0.117047 -0.397667 0.132561 0.113471
charge: 0.241590 0.242767 -0.008349 -0.020953 -0.042934 -0.019672 -0.188080 -0.134887 -0.386743 -0.269282 0.117121 0.103598 -0.633867 0.104320 -0.630897 -0.273686 0.118586 -0.137284 -0.378629 0.245765 0.245631 0.205953 0.232208 0.224470 0.204356 0.254490 0.255352 0.239777 -0.131890 -0.168104 -0.181083 -0.127933 -0.167897 -0.170348 -0.136109 0.185885 0.178701 0.177403 0.178497 0.184589 -0.138414 0.206155 0.199827
qa: -0.4236 -0.4236 -0.4000 -0.4592 -0.5237 -0.4610 -0.5505 0.9518 0.3068 0.1898 -0.1623 -0.1703 0.0970 -0.1738 0.0700 0.1220 -0.1792 -0.5440 0.3184 0.2482 0.2471 0.2407 0.3354 0.3245 0.2432 0.2712 0.2733 0.1577 -0.1185 -0.0441 -0.3043 -0.1008 -0.0485 -0.0639 0.2754 0.1277 0.1285 0.1280 0.1292 0.1170 -0.3977 0.1326 0.1135
va: 1.8534 1.8506 2.9674 3.0276 1.8698 1.8925 3.8124 -0.5592 4.2583 4.2215 3.1533 3.0851 4.2109 3.0923 4.2676 4.3663 3.1648 4.2363 3.9143 0.9582 0.9571 0.9536 0.9544 0.9600 0.9542 0.9419 0.9402 0.9475 3.9713 3.9400 4.3279 4.0599 4.0288 3.8592 3.0868 0.9604 0.9604 0.9624 0.9583 0.9666 5.0655 0.9440 0.9648
energy: -1931.823504377021
dipole: 5.80770 -5.65459 0.15311 13.05296 -12.83132 0.22164 12.58169 -12.19471 0.38698
magnitude: 0.47151 au
magnitude: 1.19849 debye
