program: Orca
programVersion: 5.0.4
elementType: S S N N O O C C C C N N C N C C N C C H H H H H H H H H C C C C C C C H H H H H C H H
keywords: PBE0 aug-cc-pVDZ AutoAux D4 VeryTightSCF
charge: 0
multiplicity: 1
formula: C17H16N6O2S2
InChI: InChI=1/C17H16N6O2S2/c18-12-10(14(24)22-16(26)20-12)9(7-6-8-4-2-1-3-5-8)11-13(19)21-17(27)23-15(11)25/h1-7,9,20-23H,18-19H2
43 atoms
S  -3.85647 -4.02853 -3.05599
S  5.68708 -0.7921 -0.16065
N  -1.37973 -0.04287 -1.55842
N  1.79863 -3.3302 1.47167
O  -0.91133 -4.10725 0.85494
O  1.1165 0.85052 -0.69292
C  -0.20582 -1.32916 0.86616
C  1.25797 -1.18656 0.52092
C  1.76965 -0.07702 -0.19203
C  2.14955 -2.18399 0.88675
N  3.15373 -0.01806 -0.34394
N  3.49091 -2.01703 0.66353
C  4.04294 -0.93924 0.06399
N  -2.46197 -1.98727 -2.11284
C  -2.80518 -3.28908 -1.99583
C  -1.60448 -1.32262 -1.27366
N  -2.22214 -3.92863 -0.96619
C  -1.05754 -1.99156 -0.19254
C  -1.35317 -3.36444 -0.03769
H  -2.86269 -1.48571 -2.89527
H  4.12942 -2.75152 0.94163
H  -1.76131 0.34987 -2.40605
H  -0.55733 0.41467 -1.15371
H  0.83247 -3.65109 1.40253
H  2.50309 -4.03134 1.64537
H  -2.43762 -4.91001 -0.84428
H  3.51351 0.79558 -0.82657
H  -0.24442 -2.04447 1.69618
C  -0.03114 3.00316 3.31333
C  -0.56196 4.11705 3.94647
C  -0.85764 2.02672 2.75104
C  -2.24256 2.2030 2.84731
C  -2.77275 3.31459 3.47845
C  -1.93676 4.27932 4.03099
C  -0.23347 0.8800 2.09267
H  1.04572 2.88057 3.24914
H  0.10209 4.86066 4.37427
H  -2.35694 5.14836 4.5253
H  -3.84954 3.43093 3.54253
H  -2.91603 1.46346 2.42872
C  -0.86069 -0.10199 1.44928
H  0.85316 0.8644 2.14405
H  -1.94573 -0.10876 1.38744
elementType: S N O C H
totalener: -1931.54713628 hartree
nucrepener: 2698.15298123 hartree
electener: -4629.70011752 hartree
oneelecener: -8008.61768221 hartree
twoeener: 3378.91756469 hartree
cpcmener: -0.06966366 hartree
kineticenergy: 1924.33166387 hartree
exchangeener: -149.744842087461 hartree
correlationener: -7.253515775078 hartree
xcener: -156.998357862539 hartree
chargesum: -0.0000000
charge: -0.303325 -0.307327 -0.069310 -0.172718 -0.973461 -1.020920 0.414203 1.051680 0.466060 0.542085 -0.413267 -0.487997 0.428872 -0.369861 0.481922 -0.269998 -0.492804 1.304675 0.778395 -0.007976 0.023044 -0.034849 0.023960 -0.029515 -0.011437 0.022799 0.004438 -0.542934 0.655338 -0.112489 1.918385 1.110778 -0.123694 0.632077 1.166267 -0.925698 -0.646287 -0.620584 -0.725673 -0.889089 0.807088 -1.081484 -1.199365
charge: 0.473278 0.474624 0.369801 0.370060 0.064772 0.081816 -0.114553 -0.039017 -0.336639 -0.176129 0.155747 0.166331 -0.716181 0.166352 -0.714495 -0.183129 0.154306 -0.043488 -0.335930 0.054127 0.054788 0.032046 -0.099668 -0.088713 0.031767 0.046553 0.046129 0.037978 0.035498 -0.003502 -0.193386 0.044169 -0.002089 -0.006914 0.026021 0.020020 0.013778 0.011673 0.014182 0.013195 0.052202 0.017976 0.024639
qa: -0.3033 -0.3073 -0.0693 -0.1727 -0.9735 -1.0209 0.4142 1.0517 0.4661 0.5421 -0.4133 -0.4880 0.4289 -0.3699 0.4819 -0.2700 -0.4928 1.3047 0.7784 -0.0080 0.0230 -0.0348 0.0240 -0.0295 -0.0114 0.0228 0.0044 -0.5429 0.6553 -0.1125 1.9184 1.1108 -0.1237 0.6321 1.1663 -0.9257 -0.6463 -0.6206 -0.7257 -0.8891 0.8071 -1.0815 -1.1994
va: 1.6888 1.6880 2.9832 2.9976 1.2800 1.3556 2.9227 2.1892 1.5233 -1.8847 2.7348 2.7754 3.1107 2.6630 2.9815 0.6246 2.8476 1.1956 -0.3940 0.8415 0.8326 0.8539 0.8640 0.9653 0.8324 0.8571 0.8681 0.6011 -0.5789 3.4093 0.6257 -0.6301 2.5874 2.8706 1.8353 -0.0270 0.4550 0.4447 0.4282 -0.1767 4.1167 -0.6157 -0.6817
energy: 33196.1 33261.2 34186.7 35693.6 36249.3 36406.4 37073.7 37789.3 38205.8 38631.6 39198.0 39292.0 40246.9 40334.9 40503.5 40840.6 40979.5 41088.8 41206.7 41885.2 41903.3 42107.5 42495.2 42888.2 43000.3 43193.3 43306.4 43360.9 44277.6 44405.7 45322.4 45454.6 45518.9 45619.2 45756.6 45837.9 46059.9 46226.8 46296.8 46394.1 46531.5 46819.8 46934.3 47000.5 47197.5 47385.4 47812.4 47911.9 48000.0 48118.2 48126.4 48239.6 48397.4 48778.8 48892.7 48903.7 48947.8 49269.3 49350.4 49729.7 49749.9 49885.7 49969.0 50052.7 50231.1 50268.0 50290.7 50347.3 50436.3 50721.9 50821.2 50995.3 51118.5 51197.7 51318.3 51326.4 51366.5 51479.4 51516.8 51649.6 51722.5 51814.9 51852.6 52102.9 52269.9 52284.2 52354.4 52468.6 52645.0 52775.7 52998.4 53253.4 53424.9 53491.3 53588.6 53711.7 53755.5 53861.2 53873.7 54034.6 54055.1 54128.7 54162.7 54260.7 54317.8 54379.4 54509.2 54602.0 54674.6 54819.1 54876.2 54990.1 55096.7 55135.7 55165.3 55213.5 55225.0 55281.9 55293.3 55315.2 55387.4 55434.6 55448.8 55454.9 55495.8 55583.8 55741.7 55801.3 55859.3 55874.8 55936.4 56008.6 56066.5 56122.6 56142.5 56163.1 56348.6 56481.2 56520.2 56641.6 56708.5 56940.0 57113.9 57229.5 57468.8 57505.8 57538.7 57610.1 57775.8 57921.2 57945.8 57989.4 58008.1 58224.4 58248.4 58272.7 58317.9 58357.4 58642.0 58649.3 58695.3 58752.4 58802.0 58858.2 58890.8 58960.6 59023.6 59041.6 59113.3 59169.4 59194.8 59265.1 59352.3 59388.9 59405.7 59570.5 59579.1 59615.9 59670.8 59856.1 59944.7 60014.6 60170.4 60190.6 60242.2 60284.9 60407.0 60505.0 60564.8 60594.1 60693.8 60746.3 60773.1 60811.9 60826.1 60901.2 60953.2 60978.3 61185.0 61209.4
energy: -1931.455133739713
dipole: -5.68041 5.52516 -0.15525 13.00952 -12.93022 0.07930 12.48374 -11.95878 0.52496
magnitude: 0.55315 au
magnitude: 1.40599 debye
