program: Orca
programVersion: 5.0.4
elementType: S S N N O O C C C C N N C N C C N C C H H H H H H H H H H H C C C C C C C H H H H H C H H
keywords: PBE0 ma-def2-TZVP AutoAux D4 VeryTightSCF TightOPT
charge: 2
multiplicity: 1
formula: C17H18N6O2S2
InChI: InChI=1/C17H18N6O2S2/c18-12-10(14(24)22-16(26)20-12)9(7-6-8-4-2-1-3-5-8)11-13(19)21-17(27)23-15(11)25/h1-7,9,20-25H,18-19H2
45 atoms
S  2.93924 -1.795314 -4.895468
S  -5.57134 0.776007 -0.403757
N  1.740639 -3.612009 -0.469524
N  -0.833654 1.312649 0.915952
O  0.349817 0.786123 -1.728817
O  -2.371577 -2.81943 -0.916974
C  -0.045544 -1.479456 0.282874
C  -1.428691 -0.862943 0.111766
C  -2.466025 -1.597175 -0.457522
C  -1.77037 0.444995 0.477167
N  -3.697497 -1.091287 -0.602242
N  -3.023404 0.898495 0.307294
C  -4.085294 0.183354 -0.232947
N  2.239008 -2.630488 -2.482905
C  2.218483 -1.646796 -3.462563
C  1.604181 -2.575008 -1.296707
N  1.54438 -0.520368 -3.034899
C  0.799566 -1.461519 -0.978728
C  0.882508 -0.40083 -1.871308
H  2.333307 -4.392221 -0.709034
H  -1.482206 -3.183996 -0.833701
H  0.062123 0.997835 -0.820622
H  -1.123556 2.230487 1.22629
H  -0.263306 -2.541457 0.468764
H  1.57098 0.279355 -3.657787
H  2.81164 -3.43018 -2.72494
H  -3.272372 1.838674 0.591428
H  -4.416403 -1.673906 -1.018768
H  -0.090832 0.883837 1.470931
H  1.546686 -3.498217 0.512787
C  0.304975 -1.142596 5.19845
C  0.862837 -0.791907 6.415235
C  0.966326 -0.856226 3.99998
C  2.20865 -0.210496 4.049435
C  2.764126 0.136252 5.263476
C  2.092034 -0.151855 6.448514
C  0.322125 -1.237254 2.760597
H  -0.655163 -1.64769 5.17183
H  0.341857 -1.020329 7.33682
H  2.534207 0.122613 7.398802
H  3.727144 0.631159 5.296365
H  2.752031 0.014917 3.138296
C  0.735651 -1.016765 1.50143
H  -0.631414 -1.751561 2.893104
H  1.689106 -0.535013 1.301553
totalener: -1932.32539782 hartree
nucrepener: 2760.59681369 hartree
electener: -4692.92221150 hartree
oneelecener: -8086.14627252 hartree
twoeener: 3393.22406101 hartree
kineticenergy: 1926.27208656 hartree
exchangeener: -149.956659297253 hartree
correlationener: -7.245360465541 hartree
xcener: -157.202019762794 hartree
chargesum: 2.0000000
charge: -0.159002 -0.152104 -0.449642 -0.440145 -0.220607 -0.238062 1.228630 -1.215235 0.191727 0.470640 -0.159355 -0.146702 -0.012454 -0.119005 -0.017638 0.221838 -0.161227 -0.855857 0.503801 0.302485 0.364074 0.390820 0.300917 0.171098 0.309267 0.283763 0.285477 0.312606 0.357509 0.320606 -0.114988 -0.107342 -0.255776 -0.014452 -0.097663 0.058617 -0.162525 0.147401 0.169168 0.171801 0.166384 0.124151 -0.134881 0.159646 0.222236
charge: 0.475802 0.486969 0.032789 -0.002313 0.137362 0.155731 -0.218552 -0.137489 -0.272085 -0.264359 0.163873 0.143069 -0.622776 0.137663 -0.624720 -0.252470 0.157644 -0.141676 -0.281890 0.228737 0.249018 0.244967 0.229126 0.223798 0.274015 0.262732 0.264353 0.275939 0.238744 0.231044 -0.110600 -0.131106 -0.205827 -0.122350 -0.132714 -0.108434 -0.123755 0.190745 0.191596 0.192497 0.190332 0.186307 -0.229306 0.211214 0.206360
qa: -0.1590 -0.1521 -0.4496 -0.4401 -0.2206 -0.2381 1.2286 -1.2152 0.1917 0.4706 -0.1594 -0.1467 -0.0125 -0.1190 -0.0176 0.2218 -0.1612 -0.8559 0.5038 0.3025 0.3641 0.3908 0.3009 0.1711 0.3093 0.2838 0.2855 0.3126 0.3575 0.3206 -0.1150 -0.1073 -0.2558 -0.0145 -0.0977 0.0586 -0.1625 0.1474 0.1692 0.1718 0.1664 0.1242 -0.1349 0.1596 0.2222
va: 2.1270 2.1404 3.1616 3.0525 2.2603 2.3067 -0.0933 4.2320 4.0337 3.5270 3.1468 3.2482 4.3060 3.1203 4.3377 4.1281 3.2411 4.5398 3.4745 0.9274 0.8990 0.8600 0.9318 0.9041 0.9194 0.9373 0.9367 0.9165 0.8876 0.9150 3.9596 4.0548 4.1370 3.9559 4.0563 3.7360 4.4535 0.9579 0.9543 0.9541 0.9532 0.9693 3.6882 0.9636 0.9378
energy: -1932.420817243162
dipole: 9.78043 -9.28526 0.49517 -1.52394 0.69603 -0.82791 22.15254 -21.88157 0.27098
magnitude: 1.00203 au
magnitude: 2.54695 debye
