program: Orca
programVersion: 5.0.4
elementType: S S N N O O C C C C N N C N C C N C C H H H H H C C C C C C C H H H H H C H H
keywords: PBE0 ma-def2-TZVP AutoAux D4 VeryTightSCF TightOPT
charge: -4
multiplicity: 1
formula: C17H12N6O2S2
InChI: InChI=1/C17H12N6O2S2/c18-12-10(14(24)22-16(26)20-12)9(7-6-8-4-2-1-3-5-8)11-13(19)21-17(27)23-15(11)25/h1-7,9H,18-19H2
39 atoms
S  3.538651 -0.965521 -4.219274
S  -5.895889 -0.254903 -0.676487
N  0.099999 -3.387335 -1.628943
N  -1.244594 1.240792 0.016619
O  1.573162 0.869553 -0.096388
O  -2.226446 -3.410249 0.212766
C  -0.148739 -1.463387 0.476715
C  -1.595782 -1.134268 0.193442
C  -2.554938 -2.174267 0.084795
C  -2.066419 0.15744 -0.043151
N  -3.855132 -1.881845 -0.17726
N  -3.356186 0.429403 -0.316507
C  -4.209769 -0.605064 -0.358727
N  1.65778 -2.154609 -2.770816
C  2.444009 -1.068832 -2.855742
C  0.847696 -2.242538 -1.703518
N  2.436306 -0.067519 -1.970497
C  0.780429 -1.269111 -0.707408
C  1.598862 -0.129084 -0.902133
H  0.044748 -3.915838 -2.484729
H  -0.724353 -3.4146 -1.031935
H  -0.229692 1.119904 0.020704
H  -1.610391 2.089263 -0.383467
H  -0.14898 -2.546722 0.661261
C  -0.607504 0.850328 4.86857
C  -0.158434 1.338485 6.08665
C  0.236312 0.131064 4.015959
C  1.554085 -0.086515 4.43753
C  2.002811 0.399565 5.653204
C  1.151422 1.117019 6.486888
C  -0.292479 -0.347432 2.740337
H  -1.633672 1.02893 4.56156
H  -0.83645 1.894741 6.725694
H  1.50693 1.495599 7.439031
H  3.028068 0.214764 5.957171
H  2.236582 -0.649143 3.81008
C  0.408304 -0.910168 1.754939
H  -1.358501 -0.189333 2.59291
H  1.478885 -1.060086 1.874616
totalener: -1929.86175817 hartree
nucrepener: 2602.89058399 hartree
electener: -4532.75234216 hartree
oneelecener: -7916.76191675 hartree
twoeener: 3384.00957459 hartree
cpcmener: -0.89591809 hartree
kineticenergy: 1923.43462598 hartree
exchangeener: -149.353762950106 hartree
correlationener: -7.222353537121 hartree
xcener: -156.576116487226 hartree
elementType: S N O C H
chargesum: -4.0000000
charge: -0.932650 -0.932846 -0.640634 -0.635396 -0.815468 -0.876687 -0.485360 0.814179 0.339684 0.120640 -0.721944 -0.675909 0.403658 -0.683099 0.488839 -0.137714 -0.673276 0.538945 0.314154 0.290158 0.289693 0.301861 0.288237 0.151038 -0.109280 -0.116886 -0.494258 -0.137398 -0.098527 -0.066352 0.482608 0.176648 0.171391 0.171556 0.173130 0.173431 -0.798067 0.184835 0.157068
charge: -0.205154 -0.205264 -0.102396 -0.088612 -0.267764 -0.293846 -0.217930 -0.181469 -0.464572 -0.355275 -0.084875 -0.077287 -0.688645 -0.077038 -0.685732 -0.346784 -0.079360 -0.174830 -0.461799 0.209963 0.208627 0.214052 0.210532 0.233928 -0.149482 -0.184707 -0.198805 -0.144453 -0.183430 -0.192865 -0.183441 0.193668 0.185568 0.183677 0.185760 0.193923 -0.135581 0.208855 0.202842
qa: -0.9327 -0.9328 -0.6406 -0.6354 -0.8155 -0.8767 -0.4854 0.8142 0.3397 0.1206 -0.7219 -0.6759 0.4037 -0.6831 0.4888 -0.1377 -0.6733 0.5389 0.3142 0.2902 0.2897 0.3019 0.2882 0.1510 -0.1093 -0.1169 -0.4943 -0.1374 -0.0985 -0.0664 0.4826 0.1766 0.1714 0.1716 0.1731 0.1734 -0.7981 0.1848 0.1571
va: 1.1094 1.1074 2.9663 2.8162 1.4177 1.4328 4.0953 -0.2086 3.9049 4.2246 2.6490 2.6100 3.6449 2.6401 3.4958 4.4426 2.7016 2.2343 3.9083 0.9323 0.9399 0.9375 0.9329 0.9588 3.9013 4.0701 4.4501 4.0958 4.0920 3.8090 2.1666 0.9516 0.9530 0.9544 0.9511 0.9595 5.1756 0.9402 0.9588
energy: -1929.924287456652
dipole: 5.97776 -2.70852 3.26924 3.50938 -1.79516 1.71422 23.97434 -11.81889 12.15546
magnitude: 12.70361 au
magnitude: 32.29000 debye
