program: Orca
programVersion: 5.0.4
elementType: S S C N N O O C C C C C O C C C N N C N C C N C C H H H H H H H H H H H H H O H
keywords: PBE0 ma-def2-TZVP AutoAux D4 VeryTightSCF TightOPT
charge: 2
multiplicity: 1
formula: C14H14N6O4S2
InChI: InChI=1/C14H14N6O4S2/c15-9-7(11(22)19-13(25)17-9)6(5-2-1-4(3-21)24-5)8-10(16)18-14(26)20-12(8)23/h1-3,6,17-20H,15-16H3
40 atoms
S  3.598232 -1.863366 -4.252122
S  -5.584793 0.51925 -1.084443
C  -0.060835 0.672123 4.72887
N  0.316588 -3.881001 -1.077865
N  -0.94312 1.523066 0.422109
O  1.259383 0.805136 -0.892843
O  -2.190567 -2.975544 -0.642491
C  -0.118352 -1.400346 0.412309
C  1.890245 -0.007499 3.182341
C  1.873228 -0.585776 1.896342
C  0.586951 0.136952 3.564149
C  0.559652 -0.759651 1.576792
O  -0.233712 -0.332881 2.571233
C  -1.45599 -0.825777 0.021115
C  -2.424182 -1.778012 -0.475427
C  -1.841146 0.465249 0.044817
N  -3.66505 -1.284761 -0.77837
N  -3.086374 0.866116 -0.294813
C  -4.064962 0.012064 -0.704166
N  1.837399 -2.773112 -2.501079
C  2.552057 -1.719228 -2.989244
C  1.006543 -2.670887 -1.442533
N  2.308265 -0.546317 -2.346589
C  0.795998 -1.517935 -0.775307
C  1.441246 -0.340684 -1.304733
H  0.327788 -4.577045 -1.828844
H  -0.696949 -3.640529 -0.860161
H  0.014525 1.312185 0.00065
H  -1.250873 2.435381 0.067664
H  -0.355013 -2.40921 0.767376
H  2.754235 0.278466 3.762208
H  2.721619 -0.840566 1.280632
H  2.781149 0.277072 -2.704927
H  1.953409 -3.666436 -2.969976
H  -3.33197 1.850005 -0.240704
H  -4.350401 -1.959252 -1.102212
H  -0.862499 1.59725 1.444026
H  0.740849 -4.310652 -0.245722
O  0.540244 1.119261 5.692441
H  -1.16332 0.653932 4.697873
totalener: -1966.33317488 hartree
nucrepener: 2732.96416635 hartree
electener: -4699.29734123 hartree
oneelecener: -8074.62803734 hartree
twoeener: 3375.33069611 hartree
cpcmener: -0.43508303 hartree
kineticenergy: 1959.83055225 hartree
exchangeener: -149.591464057418 hartree
correlationener: -7.079069575166 hartree
xcener: -156.670533632584 hartree
elementType: S C N O H
chargesum: 2.0000000
charge: -0.466286 -0.470972 0.105286 -0.408974 -0.368084 -0.485468 -0.536286 -1.052299 -0.126856 -0.004323 0.102435 -0.190886 -0.313477 0.700257 -0.017929 0.117619 -0.169649 -0.116824 0.154009 -0.115984 0.193859 -0.092219 -0.163160 1.425061 0.201731 0.386725 0.383100 0.389405 0.387633 0.268400 0.210381 0.217468 0.336999 0.347438 0.347245 0.334975 0.397149 0.408017 -0.492234 0.176720
charge: 0.241234 0.237320 -0.216933 0.183620 0.182934 0.001465 -0.009852 -0.126690 -0.071521 -0.105172 -0.246986 -0.218731 0.275196 -0.065599 -0.320644 -0.178358 0.161677 0.157574 -0.595263 0.159029 -0.594076 -0.173053 0.161674 -0.073387 -0.328831 0.271791 0.255251 0.257400 0.273809 0.262243 0.204757 0.212014 0.279543 0.281017 0.280930 0.278869 0.279479 0.280675 -0.048165 0.193763
qa: -0.4663 -0.4710 0.1053 -0.4090 -0.3681 -0.4855 -0.5363 -1.0523 -0.1269 -0.0043 0.1024 -0.1909 -0.3135 0.7003 -0.0179 0.1176 -0.1696 -0.1168 0.1540 -0.1160 0.1939 -0.0922 -0.1632 1.4251 0.2017 0.3867 0.3831 0.3894 0.3876 0.2684 0.2104 0.2175 0.3370 0.3474 0.3472 0.3350 0.3971 0.4080 -0.4922 0.1767
va: 1.7849 1.7817 3.8996 3.4683 3.3773 1.8644 1.9184 3.4733 4.0462 4.0025 3.8769 4.3890 2.3497 3.5641 4.2512 4.1286 3.3229 3.1972 4.0998 3.1910 4.0022 4.4218 3.3388 -0.4188 4.4474 0.8584 0.9024 0.9016 0.8574 0.8929 0.9502 0.9435 0.8943 0.8847 0.8868 0.8964 0.8445 0.8296 1.8299 0.9459
energy: -1966.429342024561
dipole: 3.05627 -2.69390 0.36237 -2.60625 -0.39205 -2.99830 4.18005 -5.92925 -1.74920
magnitude: 3.49011 au
magnitude: 8.87114 debye
