program: Orca
programVersion: 5.0.4
elementType: S S C N N O O C C C C C O C C C N N C N C C N C C H H H H H H H O H
keywords: PBE0 ma-def2-TZVP AutoAux D4 VeryTightSCF TightOPT
charge: -4
multiplicity: 1
formula: C14H8N6O4S2
InChI: InChI=1/C14H8N6O4S2/c15-9-7(11(22)19-13(25)17-9)6(5-2-1-4(3-21)24-5)8-10(16)18-14(26)20-12(8)23/h1-3,6H,15-16H2
34 atoms
S  3.877025 -2.217975 -4.079002
S  -5.716233 0.548537 -0.555546
C  -0.204548 0.584899 4.702804
N  0.206829 -3.759273 -1.145699
N  -0.902967 1.536875 0.016103
O  1.565391 0.798898 -0.944944
O  -2.314764 -2.999062 -0.142462
C  -0.097669 -1.304225 0.302155
C  1.800129 0.121517 3.146384
C  1.828944 -0.398243 1.842886
C  0.482528 0.148336 3.527235
C  0.525786 -0.657001 1.492164
O  -0.284669 -0.341965 2.509898
C  -1.490236 -0.795879 -0.00628
C  -2.539558 -1.751107 -0.162611
C  -1.838426 0.544402 -0.109963
N  -3.82181 -1.308047 -0.331277
N  -3.10827 0.954136 -0.297818
C  -4.055257 0.0057 -0.37633
N  1.862132 -2.911718 -2.496337
C  2.661704 -1.891715 -2.851868
C  0.983209 -2.681789 -1.504885
N  2.583336 -0.660141 -2.345899
C  0.868524 -1.457079 -0.853722
C  1.666798 -0.388611 -1.366985
H  0.238833 -4.504782 -1.825055
H  -0.731857 -3.549298 -0.777215
H  0.057437 1.294079 -0.281589
H  -1.235443 2.434971 -0.302354
H  -0.290982 -2.326392 0.656843
H  2.635692 0.452651 3.744935
H  2.68939 -0.543506 1.211481
O  0.333984 1.05684 5.691361
H  -1.304944 0.465838 4.657579
totalener: -1963.57753377 hartree
nucrepener: 2557.45746435 hartree
electener: -4521.03499811 hartree
oneelecener: -7874.64546104 hartree
twoeener: 3353.61046293 hartree
cpcmener: -0.84288322 hartree
kineticenergy: 1957.17172912 hartree
exchangeener: -149.013792187621 hartree
correlationener: -7.061051768176 hartree
xcener: -156.074843955797 hartree
elementType: S C N O H
chargesum: -4.0000000
charge: -0.941495 -0.941549 0.032574 -0.638203 -0.586733 -0.705231 -0.766539 -0.880213 -0.147704 -0.060998 0.095445 0.468440 -0.264598 0.631972 0.286804 0.024031 -0.735510 -0.704005 0.401234 -0.709939 0.379713 0.143371 -0.688882 0.517268 0.419645 0.279126 0.313126 0.321643 0.270053 0.130083 0.190887 0.188364 -0.468204 0.146022
charge: -0.220762 -0.222500 -0.258410 -0.130096 -0.104982 -0.171514 -0.198349 -0.172002 -0.110814 -0.144756 -0.282895 -0.197284 0.277740 -0.163803 -0.451947 -0.353447 -0.087359 -0.088283 -0.692394 -0.090212 -0.690653 -0.356694 -0.082241 -0.169877 -0.458265 0.205725 0.207626 0.214695 0.205545 0.245857 0.196148 0.203218 -0.040369 0.183353
qa: -0.9415 -0.9415 0.0326 -0.6382 -0.5867 -0.7052 -0.7665 -0.8802 -0.1477 -0.0610 0.0954 0.4684 -0.2646 0.6320 0.2868 0.0240 -0.7355 -0.7040 0.4012 -0.7099 0.3797 0.1434 -0.6889 0.5173 0.4196 0.2791 0.3131 0.3216 0.2701 0.1301 0.1909 0.1884 -0.4682 0.1460
va: 1.0896 1.0912 3.9882 2.8274 2.8152 1.6558 1.6254 2.8173 4.0746 3.8744 3.7069 3.4682 2.2801 1.7106 3.9258 4.2430 2.5795 2.5882 3.6384 2.6397 3.6338 4.0155 2.6099 0.2852 3.8804 0.9396 0.9426 0.9473 0.9436 0.9841 0.9573 0.9540 1.8423 0.9510
energy: -1963.636314842695
dipole: 4.00503 -0.89830 3.10673 -0.28759 0.86673 0.57913 7.36663 0.83538 8.20201
magnitude: 8.78977 au
magnitude: 22.34182 debye
