program: Orca
programVersion: 5.0.4
elementType: S S C N N O O C C C C C O C C C N N C N C C N C C H H H H H H H H H H H H H O H
keywords: PBE0 ma-def2-TZVP AutoAux D4 VeryTightSCF TightOPT
charge: 2
multiplicity: 1
formula: C14H14N6O4S2
InChI: InChI=1/C14H14N6O4S2/c15-9-7(11(22)19-13(25)17-9)6(5-2-1-4(3-21)24-5)8-10(16)18-14(26)20-12(8)23/h1-3,6,17-20H,15-16H3
40 atoms
S  3.615575 -1.90818 -4.249826
S  -5.58549 0.526595 -1.040538
C  -0.104142 0.571602 4.778836
N  0.303941 -3.874133 -1.068848
N  -0.91097 1.538595 0.365505
O  1.261471 0.811212 -0.943661
O  -2.189593 -2.970637 -0.608282
C  -0.10345 -1.387616 0.40691
C  1.865727 0.042885 3.189726
C  1.86955 -0.505032 1.887712
C  0.561362 0.10513 3.583358
C  0.566023 -0.739858 1.573445
O  -0.238778 -0.383885 2.58806
C  -1.444317 -0.815167 0.022008
C  -2.421753 -1.772364 -0.451086
C  -1.825427 0.478202 0.033044
N  -3.664109 -1.279487 -0.7422
N  -3.074074 0.875553 -0.291123
C  -4.061424 0.019745 -0.676375
N  1.841044 -2.790249 -2.495693
C  2.561354 -1.745225 -2.995497
C  1.010451 -2.674253 -1.440248
N  2.312841 -0.562776 -2.370941
C  0.805881 -1.512719 -0.783125
C  1.447509 -0.341466 -1.332772
H  0.275913 -4.559731 -1.830827
H  -0.699842 -3.620407 -0.82534
H  0.04927 1.295289 -0.042291
H  -1.202522 2.436427 -0.040931
H  -0.332431 -2.398068 0.761662
H  2.719242 0.360056 3.768911
H  2.728746 -0.703233 1.266138
H  2.785735 0.253587 -2.744779
H  1.956444 -3.690345 -2.952586
H  -3.316386 1.861212 -0.245053
H  -4.358107 -1.950862 -1.054671
H  -0.838991 1.689481 1.378984
H  0.739362 -4.333909 -0.257894
O  0.480309 1.029793 5.737228
H  -1.206444 0.481278 4.761443
totalener: -1966.38001814 hartree
nucrepener: 2732.69038841 hartree
electener: -4699.07040656 hartree
oneelecener: -8075.69605796 hartree
twoeener: 3376.62565141 hartree
cpcmener: -0.39032621 hartree
kineticenergy: 1959.87290707 hartree
exchangeener: -149.606591675027 hartree
correlationener: -7.081899466368 hartree
xcener: -156.688491141395 hartree
elementType: S C N O H
chargesum: 2.0000000
charge: -0.454912 -0.458535 0.019679 -0.384963 -0.339453 -0.436074 -0.482711 -0.822604 -0.131369 0.040273 0.147102 -0.251679 -0.329909 0.733011 -0.036180 0.023823 -0.155901 -0.130737 0.152488 -0.128528 0.181340 -0.112762 -0.154134 1.237848 0.163689 0.391375 0.345206 0.359878 0.394634 0.272232 0.208799 0.217798 0.335550 0.348261 0.348546 0.334178 0.391795 0.411426 -0.412718 0.164237
charge: 0.248590 0.245603 -0.230601 0.180246 0.177011 0.012545 0.000054 -0.132922 -0.076887 -0.105844 -0.250935 -0.230723 0.271605 -0.069964 -0.327406 -0.183149 0.162026 0.158769 -0.593312 0.160259 -0.592392 -0.173683 0.161831 -0.074533 -0.333684 0.273858 0.246996 0.249810 0.276410 0.258865 0.204430 0.211822 0.279187 0.281838 0.281957 0.278814 0.276303 0.281453 0.006430 0.189325
qa: -0.4549 -0.4585 0.0197 -0.3850 -0.3395 -0.4361 -0.4827 -0.8226 -0.1314 0.0403 0.1471 -0.2517 -0.3299 0.7330 -0.0362 0.0238 -0.1559 -0.1307 0.1525 -0.1285 0.1813 -0.1128 -0.1541 1.2378 0.1637 0.3914 0.3452 0.3599 0.3946 0.2722 0.2088 0.2178 0.3356 0.3483 0.3485 0.3342 0.3918 0.4114 -0.4127 0.1642
va: 1.7981 1.7964 3.9616 3.4246 3.3009 1.9381 1.9718 3.7366 4.0742 3.9282 3.7218 4.4802 2.3409 3.4610 4.3076 4.3131 3.3009 3.2378 4.1010 3.2177 4.0245 4.4469 3.3321 0.2968 4.5046 0.8548 0.9462 0.9412 0.8520 0.8923 0.9502 0.9418 0.8954 0.8843 0.8858 0.8971 0.8514 0.8279 1.9139 0.9478
energy: -1966.435857567750
dipole: 3.07224 -2.57841 0.49383 -2.40808 -0.32117 -2.72925 3.98074 -5.66480 -1.68405
magnitude: 3.24480 au
magnitude: 8.24763 debye
