program: Orca
programVersion: 5.0.4
elementType: S S C N N O O C C C C C O C C C N N C N C C N C C H H H H H H H H H H H O H
keywords: PBE0 ma-def2-TZVP AutoAux D4 VeryTightSCF TightOPT
charge: 0
multiplicity: 1
formula: C14H12N6O4S2
InChI: InChI=1/C14H12N6O4S2/c15-9-7(11(22)19-13(25)17-9)6(5-2-1-4(3-21)24-5)8-10(16)18-14(26)20-12(8)23/h1-3,6,17-20H,15-16H2
38 atoms
S  4.090789 -4.385339 -2.041972
S  -5.675642 -1.293097 -1.380497
C  -0.609226 3.405519 2.423579
N  1.111212 -0.478713 -2.039981
N  -1.935257 -3.128249 1.235325
O  0.985488 -3.479207 1.637731
O  -1.270679 0.840854 -1.288599
C  -0.051804 -1.011752 0.66688
C  1.465912 2.281646 1.390272
C  1.624479 0.99279 0.847394
C  0.166045 2.373599 1.807668
C  0.409067 0.376009 0.961515
O  -0.477792 1.191722 1.547588
C  -1.441994 -1.077288 0.083002
C  -1.923341 -0.106775 -0.818772
C  -2.280215 -2.121354 0.438285
N  -3.251854 -0.228405 -1.212977
N  -3.562407 -2.147214 -0.040397
C  -4.098944 -1.211172 -0.856967
N  2.43665 -2.332133 -1.86804
C  2.926564 -3.457416 -1.29986
C  1.481306 -1.521403 -1.310006
N  2.390536 -3.760909 -0.102809
C  0.982688 -1.833049 -0.055775
C  1.414124 -3.027922 0.562495
H  2.807324 -2.092324 -2.778925
H  -4.166233 -2.916692 0.21965
H  1.496802 -0.344383 -2.961312
H  0.342038 0.123006 -1.741619
H  -0.965877 -3.268258 1.507978
H  -2.592382 -3.870071 1.42288
H  2.708605 -4.607598 0.35092
H  -3.600181 0.480323 -1.845679
H  -0.117398 -1.471255 1.661193
H  2.209996 3.059537 1.46865
H  2.517465 0.564862 0.421087
O  -0.173831 4.512882 2.712209
H  -1.659132 3.13586 2.630127
totalener: -1965.51618581 hartree
nucrepener: 2670.69087361 hartree
electener: -4636.20705941 hartree
oneelecener: -8004.86972053 hartree
twoeener: 3368.66266111 hartree
cpcmener: -0.08595612 hartree
kineticenergy: 1959.16164216 hartree
exchangeener: -149.469719311290 hartree
correlationener: -7.077263833212 hartree
xcener: -156.546983144502 hartree
elementType: S C N O H
chargesum: -0.0000000
charge: -0.555720 -0.554224 0.096910 -0.536403 -0.578907 -0.662200 -0.633207 0.456554 -0.158155 0.141340 0.142578 -0.260863 -0.369522 0.255414 0.440410 0.133935 -0.192789 -0.141602 0.196480 -0.153403 0.173090 0.476393 -0.222617 -0.615504 0.231167 0.325358 0.323661 0.330774 0.336572 0.320950 0.333222 0.321182 0.323484 0.210547 0.204210 0.208516 -0.518502 0.170871
charge: 0.151771 0.151787 -0.226647 0.031233 0.027160 -0.103028 -0.078325 -0.146412 -0.083747 -0.128623 -0.259823 -0.204049 0.277872 -0.121307 -0.374098 -0.248277 0.132728 0.135843 -0.611119 0.133750 -0.611729 -0.258560 0.129604 -0.129395 -0.377087 0.269610 0.269680 0.234362 0.231064 0.227715 0.234030 0.267895 0.268720 0.255052 0.201857 0.208387 -0.069321 0.191430
qa: -0.5557 -0.5542 0.0969 -0.5364 -0.5789 -0.6622 -0.6332 0.4566 -0.1582 0.1413 0.1426 -0.2609 -0.3695 0.2554 0.4404 0.1339 -0.1928 -0.1416 0.1965 -0.1534 0.1731 0.4764 -0.2226 -0.6155 0.2312 0.3254 0.3237 0.3308 0.3366 0.3209 0.3332 0.3212 0.3235 0.2105 0.2042 0.2085 -0.5185 0.1709
va: 1.6644 1.6661 3.9028 3.0172 3.1484 1.7323 1.7888 2.7236 4.0308 3.5186 3.8373 4.2676 2.4932 2.7284 3.8112 4.2579 3.2676 3.1823 4.0199 3.1954 4.0720 3.6236 3.2627 3.5038 4.0581 0.9030 0.9030 0.9083 0.9142 0.9235 0.9051 0.9054 0.9029 0.9319 0.9529 0.9517 1.7999 0.9476
energy: -1965.594608623363
dipole: 2.09439 -1.95085 0.14354 0.70148 -3.21470 -2.51322 1.45450 -2.48012 -1.02562
magnitude: 2.71823 au
magnitude: 6.90919 debye
