program: Orca
programVersion: 5.0.4
elementType: S S C N N O O C C C C C O C C C N N C N C C N C C H H H H H H H H H H H O H
keywords: PBE0 aug-cc-pVDZ AutoAux D4 VeryTightSCF
charge: 0
multiplicity: 1
formula: C14H12N6O4S2
InChI: InChI=1/C14H12N6O4S2/c15-9-7(11(22)19-13(25)17-9)6(5-2-1-4(3-21)24-5)8-10(16)18-14(26)20-12(8)23/h1-3,6,17-20H,15-16H2
38 atoms
S  -4.14152 -4.36671 -2.06025
S  5.7122 -1.24586 -1.27727
C  0.67065 3.39568 2.36884
N  -1.2204 -0.40826 -2.00249
N  1.9562 -3.08255 1.32795
O  -0.88228 -3.57933 1.51326
O  1.24121 0.75167 -1.38394
C  0.03862 -1.02922 0.64636
C  -1.44596 2.2754 1.40405
C  -1.62741 0.98392 0.87047
C  -0.13411 2.3592 1.78068
C  -0.41192 0.36252 0.9499
O  0.49087 1.17719 1.50746
C  1.43644 -1.09531 0.0814
C  1.90544 -0.14809 -0.85842
C  2.29431 -2.09922 0.49522
N  3.25056 -0.24986 -1.21353
N  3.58879 -2.10451 0.04753
C  4.11708 -1.18829 -0.79495
N  -2.50775 -2.29705 -1.86264
C  -2.95624 -3.45324 -1.32537
C  -1.54289 -1.49329 -1.30945
N  -2.36273 -3.80105 -0.16994
C  -0.99508 -1.84327 -0.08684
C  -1.3675 -3.08319 0.49019
H  -2.91906 -2.02501 -2.74661
H  4.20649 -2.84798 0.34772
H  -1.61541 -0.26037 -2.91824
H  -0.39943 0.14444 -1.73883
H  0.97362 -3.27428 1.52477
H  2.62488 -3.8061 1.54569
H  -2.64534 -4.67489 0.25465
H  3.59571 0.4405 -1.86784
H  0.09373 -1.50106 1.63559
H  -2.18363 3.0575 1.49995
H  -2.53592 0.56199 0.47254
O  0.25734 4.50048 2.66574
H  1.72752 3.11411 2.53888
elementType: S C N O H
totalener: -1965.26029399 hartree
nucrepener: 2667.18174321 hartree
electener: -4632.44203720 hartree
oneelecener: -7996.10033199 hartree
twoeener: 3363.65829479 hartree
cpcmener: -0.06385807 hartree
kineticenergy: 1957.94199107 hartree
exchangeener: -149.417670351032 hartree
correlationener: -7.093290794031 hartree
xcener: -156.510961145063 hartree
chargesum: 0.0000000
charge: -0.309897 -0.305017 1.323647 -0.146750 -0.217203 -0.902103 -0.987967 0.663299 0.175021 1.454703 0.138598 -0.357649 -0.762524 1.185542 0.675142 0.332826 -0.507330 -0.508749 0.517717 -0.328886 0.476573 -0.296678 -0.484471 1.373238 0.662150 -0.010266 0.031279 -0.069205 0.070823 -0.028356 -0.016490 0.020519 0.009972 -0.398453 -0.602554 -0.759199 -0.728392 -0.382909
charge: 0.473349 0.472059 -0.136770 0.373060 0.373132 0.096875 0.113718 -0.087048 0.076850 0.073316 -0.222852 -0.174497 0.223632 -0.039147 -0.332105 -0.178101 0.157161 0.166377 -0.713036 0.166760 -0.713789 -0.186591 0.156137 -0.040326 -0.335691 0.053742 0.054597 0.034428 -0.098061 -0.087798 0.034152 0.046252 0.046098 0.047017 0.025918 0.023491 0.038019 0.019674
qa: -0.3099 -0.3050 1.3236 -0.1467 -0.2172 -0.9021 -0.9880 0.6633 0.1750 1.4547 0.1386 -0.3576 -0.7625 1.1855 0.6751 0.3328 -0.5073 -0.5087 0.5177 -0.3289 0.4766 -0.2967 -0.4845 1.3732 0.6621 -0.0103 0.0313 -0.0692 0.0708 -0.0284 -0.0165 0.0205 0.0100 -0.3985 -0.6026 -0.7592 -0.7284 -0.3829
va: 1.6908 1.6985 2.0704 2.9548 2.9847 1.3214 1.3927 1.0042 3.3219 0.2537 3.1428 4.7043 1.0299 1.2760 1.0664 -2.3309 2.9616 2.7267 2.9333 2.6344 2.9888 0.5628 2.7856 1.6032 -0.1390 0.8386 0.8250 0.8480 0.8101 0.9567 0.8276 0.8599 0.8493 0.8217 0.5458 0.1670 1.5895 0.7208
energy: 30355.7 31357.0 33123.6 33165.8 34293.4 34551.5 36491.9 36726.3 37142.4 37249.7 37992.7 39253.4 39390.8 39666.2 39825.8 40443.7 40528.9 41129.8 41153.3 41484.4 41637.9 41815.7 42131.1 42449.1 42534.8 42706.9 43200.4 43486.0 44172.2 44252.7 45303.9 45397.7 45711.4 45788.2 45849.8 46028.5 46253.7 46361.1 46589.5 46713.8 46759.9 47281.8 47371.7 47489.9 47710.8 47776.2 47863.7 48234.9 48359.6 48760.9 48828.7 48896.9 49030.1 49155.9 49403.9 49465.4 49633.3 49693.9 49821.6 49950.0 50076.1 50122.6 50196.3 50299.0 50407.2 50493.3 50633.6 50700.5 50719.6 50877.8 51162.5 51233.1 51271.0 51488.0 51537.3 51631.3 51697.8 51817.4 51906.1 52333.9 52586.5 52645.1 52771.2 52811.3 53032.6 53114.7 53156.5 53494.5 53692.0 53859.7 53894.8 53946.7 54012.4 54102.4 54292.1 54371.4 54530.7 54555.7 54691.7 54775.6 54847.8 54904.7 54964.8 55035.9 55087.6 55171.1 55218.7 55238.9 55285.5 55383.8 55400.8 55507.5 55637.1 55758.3 55807.1 55898.2 56006.0 56057.7 56097.8 56207.7 56309.0 56385.4 56432.3 56517.5 56578.9 56594.7 56726.6 56813.8 56978.3 57051.3 57075.9 57140.4 57197.5 57332.6 57413.0 57520.1 57753.9 57867.8 57922.1 58077.7 58136.6 58189.3 58366.2 58426.1 58445.7 58534.9 58552.4 58709.2 58778.5 58842.6 58877.8 58976.7 58988.9 59046.0 59072.4 59137.2 59249.2 59330.3 59462.9 59488.5 59618.3 59698.8 59764.0 59890.8 59902.0 59941.3 59983.0 60050.1 60123.9 60221.6 60261.1 60457.3 60517.6 60558.5 60692.0 60768.9 60868.9 60901.5 60952.9 61048.0 61161.4 61245.9 61298.9 61423.3 61459.5 61713.2 61750.2 61775.8 61949.5 61989.7 62062.4 62237.1 62286.7 62371.7 62434.2 62494.5 62534.8 62578.8 62642.0 62717.0
energy: -1965.176966318856
dipole: -2.21752 1.92064 -0.29688 0.84678 -2.77184 -1.92506 1.66816 -2.28353 -0.61537
magnitude: 2.04271 au
magnitude: 5.19217 debye
