program: Orca
programVersion: 5.0.4
elementType: S S C N N O O C C C C C O C C C N N C N C C N C C H H H H H H H H H H H H H O H
keywords: PBE0 aug-cc-pVDZ AutoAux D4 VeryTightSCF
charge: 2
multiplicity: 1
formula: C14H14N6O4S2
InChI: InChI=1/C14H14N6O4S2/c15-9-7(11(22)19-13(25)17-9)6(5-2-1-4(3-21)24-5)8-10(16)18-14(26)20-12(8)23/h1-3,6,17-20H,15-16H3
40 atoms
S  3.598232 -1.863366 -4.252122
S  -5.584793 0.51925 -1.084443
C  -0.060835 0.672123 4.72887
N  0.316588 -3.881001 -1.077865
N  -0.94312 1.523066 0.422109
O  1.259383 0.805136 -0.892843
O  -2.190567 -2.975544 -0.642491
C  -0.118352 -1.400346 0.412309
C  1.890245 -0.007499 3.182341
C  1.873228 -0.585776 1.896342
C  0.586951 0.136952 3.564149
C  0.559652 -0.759651 1.576792
O  -0.233712 -0.332881 2.571233
C  -1.45599 -0.825777 0.021115
C  -2.424182 -1.778012 -0.475427
C  -1.841146 0.465249 0.044817
N  -3.66505 -1.284761 -0.77837
N  -3.086374 0.866116 -0.294813
C  -4.064962 0.012064 -0.704166
N  1.837399 -2.773112 -2.501079
C  2.552057 -1.719228 -2.989244
C  1.006543 -2.670887 -1.442533
N  2.308265 -0.546317 -2.346589
C  0.795998 -1.517935 -0.775307
C  1.441246 -0.340684 -1.304733
H  0.327788 -4.577045 -1.828844
H  -0.696949 -3.640529 -0.860161
H  0.014525 1.312185 0.00065
H  -1.250873 2.435381 0.067664
H  -0.355013 -2.40921 0.767376
H  2.754235 0.278466 3.762208
H  2.721619 -0.840566 1.280632
H  2.781149 0.277072 -2.704927
H  1.953409 -3.666436 -2.969976
H  -3.33197 1.850005 -0.240704
H  -4.350401 -1.959252 -1.102212
H  -0.862499 1.59725 1.444026
H  0.740849 -4.310652 -0.245722
O  0.540244 1.119261 5.692441
H  -1.16332 0.653932 4.697873
elementType: S C N O H
totalener: -1966.08706241 hartree
nucrepener: 2732.69038841 hartree
electener: -4698.77745082 hartree
oneelecener: -8073.39829064 hartree
twoeener: 3374.62083981 hartree
cpcmener: -0.41906240 hartree
kineticenergy: 1958.52480976 hartree
exchangeener: -149.535366317141 hartree
correlationener: -7.094256872536 hartree
xcener: -156.629623189677 hartree
chargesum: 2.0000000
charge: -0.215580 -0.224756 1.392788 -0.668871 -0.653808 -1.014184 -0.995830 1.063704 0.175352 1.412993 0.120613 -0.415985 -0.755724 1.339467 0.694533 0.678297 -0.553256 -0.459572 0.497424 -0.461356 0.383131 1.076270 -0.396698 0.831991 0.169114 0.297543 0.228737 0.239128 0.303576 -0.371143 -0.587792 -0.776103 0.033807 0.019001 -0.003308 0.061895 0.358514 0.352458 -0.773695 -0.402675
charge: 0.566989 0.563141 -0.114408 0.541402 0.535275 0.164424 0.156948 -0.056605 0.098574 0.095173 -0.201906 -0.171868 0.228432 0.009400 -0.255334 -0.064410 0.184553 0.185564 -0.690718 0.188361 -0.689618 -0.057706 0.186417 0.001761 -0.262373 0.118976 -0.040495 -0.047079 0.121566 0.074920 0.033539 0.036959 0.065720 0.076731 0.075356 0.065984 0.101617 0.134007 0.011659 0.029070
qa: -0.2156 -0.2248 1.3928 -0.6689 -0.6538 -1.0142 -0.9958 1.0637 0.1754 1.4130 0.1206 -0.4160 -0.7557 1.3395 0.6945 0.6783 -0.5533 -0.4596 0.4974 -0.4614 0.3831 1.0763 -0.3967 0.8320 0.1691 0.2975 0.2287 0.2391 0.3036 -0.3711 -0.5878 -0.7761 0.0338 0.0190 -0.0033 0.0619 0.3585 0.3525 -0.7737 -0.4027
va: 1.7896 1.7857 1.7799 2.7934 2.9442 1.3274 1.3228 1.1094 3.1788 -0.0231 3.1577 4.6044 1.0448 0.8793 -0.6847 -3.2069 2.7533 2.6765 3.0561 2.7223 3.2239 -6.4121 2.7387 1.3264 1.7013 0.7161 0.9734 0.9260 0.6947 0.7243 0.5398 0.1931 0.8653 0.8521 0.8552 0.8470 0.7670 0.7748 1.5739 0.7348
energy: 29783.6 29909.4 31920.9 32305.4 32847.4 33569.2 33913.9 33959.3 34562.9 35577.6 35682.6 36306.9 36415.0 36648.4 36950.2 37319.1 37558.9 38599.3 39071.7 39154.5 39929.1 40728.4 40775.0 41257.9 41712.6 41978.9 42276.1 43749.6 44224.0 44925.7 44947.8 45250.6 46464.6 46565.3 46846.9 47199.0 47493.0 47588.0 47696.2 47992.6 48046.0 48098.9 48321.3 48429.3 48601.2 49452.7 49592.3 50028.7 50534.1 50859.7 51348.7 51485.5 51908.0 52013.1 52154.8 52227.9 52270.0 52350.4 52434.4 52650.4 53034.2 53052.8 53242.5 53447.7 53492.1 53642.3 53707.0 53773.4 53967.5 53985.1 54150.4 54209.4 54664.5 54920.8 54968.1 55127.7 55402.8 55507.6 55569.1 55686.1 55844.1 56268.3 56437.9 56486.7 56561.5 56752.5 56920.0 57007.3 57098.6 57294.9 57315.3 57391.1 57524.4 57632.7 57843.4 57910.4 58257.0 58348.3 58416.8 58621.6 58823.5 58976.2 59006.9 59267.7 59295.5 59316.4 59555.0 59683.7 59786.1 59946.0 60008.8 60068.7 60121.0 60294.2 60360.8 60452.6 60500.2 60667.7 60848.4 61021.9 61103.3 61287.3 61338.3 61453.1 61528.8 61543.8 61685.6 61797.9 61888.7 61914.5 61976.1 62015.1 62042.8 62064.5 62119.5 62220.1 62444.1 62447.4 62635.0 62701.0 62768.9 62795.6 62876.7 62907.2 62920.1 63146.9 63198.1 63292.0 63408.3 63507.5 63599.4 63702.0 63757.0 63858.0 63865.9 63945.2 64016.8 64178.0 64264.3 64301.2 64362.5 64533.7 64554.9 64702.6 64861.8 64912.9 64961.6 64993.8 65094.1 65203.2 65230.9 65329.5 65338.3 65361.3 65464.5 65548.4 65593.5 65731.3 65770.2 65896.1 66041.5 66064.0 66112.5 66130.7 66147.0 66273.2 66388.7 66408.5 66504.8 66524.7 66566.5 66620.0 66674.2 66755.9 66781.3 66859.8 66931.9 67046.2 67105.5 67158.4
energy: -1966.006617540843
dipole: 3.05627 -2.68382 0.37245 -2.60625 -0.40090 -3.00715 4.18005 -5.88782 -1.70777
magnitude: 3.47824 au
magnitude: 8.84097 debye
