program: Orca
programVersion: 5.0.4
elementType: S S C N N O O C C C C C O C C C N N C N C C N C C H H H H H H H H H H H H H O H
keywords: PBE0 aug-cc-pVDZ AutoAux D4 VeryTightSCF
charge: 2
multiplicity: 1
formula: C14H14N6O4S2
InChI: InChI=1/C14H14N6O4S2/c15-9-7(11(22)19-13(25)17-9)6(5-2-1-4(3-21)24-5)8-10(16)18-14(26)20-12(8)23/h1-3,6,17-20H,15-16H3
40 atoms
S  3.615575 -1.90818 -4.249826
S  -5.58549 0.526595 -1.040538
C  -0.104142 0.571602 4.778836
N  0.303941 -3.874133 -1.068848
N  -0.91097 1.538595 0.365505
O  1.261471 0.811212 -0.943661
O  -2.189593 -2.970637 -0.608282
C  -0.10345 -1.387616 0.40691
C  1.865727 0.042885 3.189726
C  1.86955 -0.505032 1.887712
C  0.561362 0.10513 3.583358
C  0.566023 -0.739858 1.573445
O  -0.238778 -0.383885 2.58806
C  -1.444317 -0.815167 0.022008
C  -2.421753 -1.772364 -0.451086
C  -1.825427 0.478202 0.033044
N  -3.664109 -1.279487 -0.7422
N  -3.074074 0.875553 -0.291123
C  -4.061424 0.019745 -0.676375
N  1.841044 -2.790249 -2.495693
C  2.561354 -1.745225 -2.995497
C  1.010451 -2.674253 -1.440248
N  2.312841 -0.562776 -2.370941
C  0.805881 -1.512719 -0.783125
C  1.447509 -0.341466 -1.332772
H  0.275913 -4.559731 -1.830827
H  -0.699842 -3.620407 -0.82534
H  0.04927 1.295289 -0.042291
H  -1.202522 2.436427 -0.040931
H  -0.332431 -2.398068 0.761662
H  2.719242 0.360056 3.768911
H  2.728746 -0.703233 1.266138
H  2.785735 0.253587 -2.744779
H  1.956444 -3.690345 -2.952586
H  -3.316386 1.861212 -0.245053
H  -4.358107 -1.950862 -1.054671
H  -0.838991 1.689481 1.378984
H  0.739362 -4.333909 -0.257894
O  0.480309 1.029793 5.737228
H  -1.206444 0.481278 4.761443
elementType: S C N O H
totalener: -1966.09346849 hartree
nucrepener: 2730.63631439 hartree
electener: -4696.72978287 hartree
oneelecener: -8070.18195112 hartree
twoeener: 3373.45216825 hartree
cpcmener: -0.38951489 hartree
kineticenergy: 1958.55007172 hartree
exchangeener: -149.534769822009 hartree
correlationener: -7.095352787330 hartree
xcener: -156.630122609339 hartree
chargesum: 2.0000000
charge: -0.204729 -0.212964 1.360564 -0.670251 -0.697271 -0.980752 -0.953684 1.077908 0.210449 1.435281 0.088330 -0.421368 -0.732289 1.235426 0.689820 0.722645 -0.543157 -0.477382 0.499066 -0.453882 0.394398 1.006911 -0.389427 0.799876 0.244804 0.301928 0.186947 0.243661 0.304135 -0.403665 -0.587968 -0.776613 0.033356 0.020967 0.003207 0.063009 0.346470 0.367957 -0.712204 -0.419513
charge: 0.573908 0.571028 -0.118919 0.538347 0.529656 0.174653 0.165395 -0.063391 0.094624 0.093772 -0.206772 -0.182307 0.219960 0.004961 -0.258923 -0.068765 0.184692 0.185546 -0.687760 0.188618 -0.686869 -0.058178 0.185995 0.002221 -0.262798 0.121023 -0.052430 -0.060920 0.123333 0.069774 0.032810 0.036408 0.065340 0.078098 0.076949 0.066163 0.107572 0.135865 0.056183 0.025140
qa: -0.2047 -0.2130 1.3606 -0.6703 -0.6973 -0.9808 -0.9537 1.0779 0.2104 1.4353 0.0883 -0.4214 -0.7323 1.2354 0.6898 0.7226 -0.5432 -0.4774 0.4991 -0.4539 0.3944 1.0069 -0.3894 0.7999 0.2448 0.3019 0.1869 0.2437 0.3041 -0.4037 -0.5880 -0.7766 0.0334 0.0210 0.0032 0.0630 0.3465 0.3680 -0.7122 -0.4195
va: 1.7997 1.7935 1.9004 2.8048 2.8928 1.3689 1.3815 1.0639 3.1680 0.0033 3.2214 4.5999 1.0261 1.1829 -0.5548 -3.3266 2.7411 2.6594 3.0527 2.6896 3.2028 -6.0257 2.7420 1.5175 1.6745 0.7206 1.0198 0.9227 0.7170 0.7041 0.5377 0.1938 0.8644 0.8536 0.8548 0.8466 0.7766 0.7549 1.6187 0.7208
energy: 29458.6 29525.1 30764.1 31806.4 32436.4 33126.8 33460.3 33523.4 34000.4 35272.9 35876.1 35918.5 36148.3 36826.4 38044.6 38210.4 38419.7 38592.1 38905.0 38934.6 39444.1 40129.7 40532.3 40713.1 40940.8 41009.4 41855.2 42069.4 44066.5 44687.7 44843.3 44912.9 45134.2 45575.6 46173.4 46458.9 47014.0 47551.2 47784.3 47938.7 48009.7 48040.2 48357.1 48613.0 49310.9 49522.6 49856.9 49952.1 50744.4 50988.2 51190.0 51373.6 51834.7 51938.3 52052.9 52107.3 52236.0 52347.7 52433.9 52517.1 52955.3 53117.6 53273.5 53373.2 53506.1 53673.7 53927.0 53997.5 54036.7 54094.0 54309.5 54413.7 54678.2 54789.0 54811.1 54995.7 55133.5 55174.8 55460.6 55677.1 55723.8 55732.7 55898.8 56133.0 56533.6 56653.2 56687.6 56850.5 56884.2 57105.7 57261.5 57282.6 57420.8 57485.1 57611.3 57852.4 57877.3 58079.7 58305.4 58341.5 58372.5 58536.7 58818.8 58929.7 59002.1 59258.9 59363.9 59371.7 59523.0 59710.7 59727.4 59870.4 59952.7 60012.7 60061.4 60383.9 60429.7 60532.9 60563.7 60635.6 60802.3 60911.2 61028.2 61201.3 61277.2 61393.0 61499.4 61549.4 61590.1 61690.3 61738.8 61750.4 61805.9 61886.7 61989.9 62030.1 62212.1 62247.4 62346.2 62512.1 62568.6 62653.2 62656.9 62830.6 62841.7 62992.4 63066.8 63081.3 63238.2 63343.2 63460.6 63699.7 63756.9 63775.0 63878.2 63928.5 64000.9 64071.0 64102.4 64145.3 64235.7 64335.1 64374.9 64439.3 64617.4 64729.1 64756.1 64783.5 64907.2 64923.8 65007.4 65041.0 65065.1 65173.1 65212.6 65318.0 65324.6 65459.8 65506.5 65656.1 65700.8 65742.9 65840.1 65873.7 65954.1 66067.6 66114.7 66180.5 66218.2 66248.9 66304.5 66360.2 66412.7 66453.1 66501.8 66620.8 66656.9 66706.5 66721.4 66778.1
energy: -1966.014393169041
dipole: 3.07224 -2.56949 0.50275 -2.40808 -0.32892 -2.73700 3.98074 -5.62203 -1.64129
magnitude: 3.23076 au
magnitude: 8.21193 debye
