program: Orca
programVersion: 5.0.4
elementType: S S C N N O O C C C C C O C C C N N C N C C N C C H H H H H H H H H H H O H
keywords: PBE0 ma-def2-TZVP AutoAux D4 VeryTightSCF TightOPT
charge: 0
multiplicity: 1
formula: C14H12N6O4S2
InChI: InChI=1/C14H12N6O4S2/c15-9-7(11(22)19-13(25)17-9)6(5-2-1-4(3-21)24-5)8-10(16)18-14(26)20-12(8)23/h1-3,6,17-20H,15-16H2
38 atoms
S  4.18644 -4.333101 -2.083529
S  -5.730122 -1.18706 -1.170901
C  -0.735943 3.393982 2.29244
N  1.306052 -0.343689 -1.978722
N  -1.972843 -3.045067 1.423736
O  0.790854 -3.658391 1.378588
O  -1.200773 0.64889 -1.459378
C  -0.023901 -1.053388 0.630086
C  1.41963 2.25874 1.44029
C  1.62766 0.962048 0.921455
C  0.093545 2.342203 1.747633
C  0.41213 0.342103 0.943029
O  -0.518813 1.161336 1.448812
C  -1.428684 -1.125812 0.08668
C  -1.88684 -0.19871 -0.887192
C  -2.305334 -2.080963 0.552284
N  -3.23935 -0.265535 -1.210733
N  -3.608859 -2.062195 0.131341
C  -4.141483 -1.155571 -0.739284
N  2.571257 -2.258728 -1.862517
C  2.998819 -3.452504 -1.359177
C  1.59764 -1.462159 -1.312407
N  2.34515 -3.831554 -0.237899
C  1.008777 -1.848302 -0.124986
C  1.334396 -3.127516 0.407452
H  3.031336 -1.982189 -2.716063
H  -4.264802 -2.752212 0.463226
H  1.709042 -0.181632 -2.884351
H  0.448575 0.174724 -1.742238
H  -0.985709 -3.294954 1.542871
H  -2.650329 -3.743486 1.672596
H  2.594805 -4.727077 0.155579
H  -3.574034 0.410409 -1.881992
H  -0.060238 -1.544675 1.610064
H  2.140831 3.048949 1.574591
H  2.552378 0.534896 0.570756
O  -0.323976 4.486136 2.605577
H  -1.804385 3.118681 2.404523
totalener: -1965.48408842 hartree
nucrepener: 2668.29620025 hartree
electener: -4633.78028867 hartree
oneelecener: -8001.04389163 hartree
twoeener: 3367.26360296 hartree
kineticenergy: 1959.32909580 hartree
exchangeener: -149.495944869242 hartree
correlationener: -7.080158209495 hartree
xcener: -156.576103078737 hartree
chargesum: -0.0000000
charge: -0.407654 -0.412283 -0.085566 -0.439284 -0.473549 -0.532534 -0.512293 0.144602 -0.101996 0.018341 0.213246 0.150557 -0.340098 0.419901 0.303235 0.345744 -0.160049 -0.147014 0.092305 -0.165286 0.035081 0.470372 -0.174974 -1.023710 0.361808 0.250952 0.247112 0.247149 0.337673 0.321050 0.247719 0.273389 0.274672 0.167565 0.161163 0.147351 -0.372505 0.117807
charge: 0.253354 0.252848 -0.247175 0.000375 -0.011984 -0.039226 -0.011036 -0.148882 -0.094121 -0.136620 -0.251407 -0.218295 0.287502 -0.122166 -0.374493 -0.266155 0.122954 0.105838 -0.629692 0.104138 -0.631735 -0.276887 0.119859 -0.131385 -0.380334 0.246641 0.246170 0.208165 0.232005 0.224904 0.205914 0.255374 0.256079 0.247766 0.192650 0.195394 0.037255 0.176408
qa: -0.4077 -0.4123 -0.0856 -0.4393 -0.4735 -0.5325 -0.5123 0.1446 -0.1020 0.0183 0.2132 0.1506 -0.3401 0.4199 0.3032 0.3457 -0.1600 -0.1470 0.0923 -0.1653 0.0351 0.4704 -0.1750 -1.0237 0.3618 0.2510 0.2471 0.2471 0.3377 0.3211 0.2477 0.2734 0.2747 0.1676 0.1612 0.1474 -0.3725 0.1178
va: 1.8725 1.8641 4.0295 2.9648 3.0433 1.9042 1.9750 2.8438 3.9035 3.6881 3.5718 3.9271 2.4899 1.6238 4.1422 3.8198 3.1586 3.0583 4.2184 3.0945 4.3262 3.5573 3.1344 3.5318 3.7725 0.9571 0.9586 0.9525 0.9530 0.9578 0.9536 0.9406 0.9391 0.9467 0.9646 0.9679 1.9885 0.9544
energy: -1965.542898987256
dipole: 2.28629 -2.12126 0.16503 0.97126 -2.40611 -1.43485 1.92119 -2.46604 -0.54485
magnitude: 1.54366 au
magnitude: 3.92367 debye
