program: Orca
programVersion: 5.0.4
elementType: S S H N N O O C C C C C O C C C N N C N C C N C C H H H H H H H H H H H H H
keywords: PBE0 ma-def2-TZVP AutoAux D4 VeryTightSCF TightOPT
charge: 2
multiplicity: 1
formula: C13H14N6O3S2
InChI: InChI=1/C13H14N6O3S2/c14-8-6(10(20)18-12(23)16-8)5(4-2-1-3-22-4)7-9(15)17-13(24)19-11(7)21/h1-3,5,16-19H,14-15H3
38 atoms
S  3.615451 -1.947864 -4.248227
S  -5.570566 0.553624 -1.078035
H  0.027117 0.426106 4.477208
N  0.305954 -3.88333 -1.043985
N  -0.902312 1.528986 0.385968
O  1.228507 0.808833 -0.998981
O  -2.191414 -2.96053 -0.651529
C  -0.105834 -1.389185 0.404838
C  1.82629 0.126143 3.181834
C  1.846201 -0.420887 1.863098
C  0.535236 0.113377 3.578758
C  0.562174 -0.72164 1.561235
O  -0.250353 -0.408393 2.601352
C  -1.442753 -0.814042 0.007274
C  -2.418756 -1.762441 -0.483972
C  -1.820809 0.479536 0.031644
N  -3.657254 -1.26127 -0.781029
N  -3.064674 0.886659 -0.301127
C  -4.050421 0.038492 -0.704958
N  1.843436 -2.814347 -2.483482
C  2.557063 -1.772804 -2.997811
C  1.012698 -2.687385 -1.428415
N  2.298452 -0.582921 -2.393026
C  0.802554 -1.519348 -0.785459
C  1.429755 -0.350246 -1.358362
H  0.29688 -4.586142 -1.790237
H  -0.702978 -3.625751 -0.825262
H  0.049042 1.292749 -0.044303
H  -1.197962 2.440319 0.01528
H  -0.341365 -2.397091 0.760648
H  2.669118 0.485963 3.751543
H  2.710685 -0.568503 1.234423
H  2.763601 0.231293 -2.780815
H  1.964544 -3.720323 -2.926534
H  -3.303912 1.8723 -0.244569
H  -4.351082 -1.92638 -1.106631
H  -0.810666 1.640718 1.402992
H  0.727049 -4.322914 -0.214816
totalener: -1853.12628775 hartree
nucrepener: 2464.83340485 hartree
electener: -4317.95969260 hartree
oneelecener: -7390.75059227 hartree
twoeener: 3072.79089967 hartree
cpcmener: -0.36581625 hartree
kineticenergy: 1847.05976341 hartree
exchangeener: -139.544457346244 hartree
correlationener: -6.604032705564 hartree
xcener: -146.148490051808 hartree
elementType: S H N O C
chargesum: 2.0000000
charge: -0.460634 -0.463358 0.209181 -0.382163 -0.315128 -0.444247 -0.485967 -0.347131 -0.246545 0.038564 -0.037675 -0.562340 -0.273330 0.645836 -0.046355 0.007532 -0.152541 -0.128975 0.154401 -0.127253 0.184633 -0.085904 -0.158450 0.908281 0.240038 0.390156 0.346601 0.363506 0.393061 0.266203 0.195547 0.211386 0.334662 0.347520 0.347155 0.333281 0.390306 0.410147
charge: 0.243539 0.240484 0.193284 0.178701 0.174817 0.011890 -0.001126 -0.139282 -0.174806 -0.136648 -0.214990 -0.265724 0.231334 -0.071634 -0.327465 -0.184392 0.160970 0.157908 -0.593671 0.158819 -0.593535 -0.175423 0.160241 -0.074462 -0.333913 0.273051 0.247363 0.251072 0.274960 0.253941 0.190794 0.207556 0.278741 0.281250 0.281326 0.278307 0.275975 0.280752
qa: -0.4606 -0.4634 0.2092 -0.3822 -0.3151 -0.4442 -0.4860 -0.3471 -0.2465 0.0386 -0.0377 -0.5623 -0.2733 0.6458 -0.0464 0.0075 -0.1525 -0.1290 0.1544 -0.1273 0.1846 -0.0859 -0.1585 0.9083 0.2400 0.3902 0.3466 0.3635 0.3931 0.2662 0.1955 0.2114 0.3347 0.3475 0.3472 0.3333 0.3903 0.4101
va: 1.7915 1.7910 0.9575 3.4260 3.3074 1.9476 1.9688 3.5172 4.2059 3.9322 3.7494 4.9282 2.1900 3.5298 4.3343 4.3201 3.2957 3.2437 4.0958 3.2197 4.0235 4.4246 3.3343 1.3538 4.4052 0.8555 0.9449 0.9346 0.8526 0.8925 0.9593 0.9469 0.8962 0.8848 0.8868 0.8979 0.8512 0.8289
energy: -1853.178816987286
dipole: 4.70025 -3.79373 0.90652 -0.77769 -0.75553 -1.53322 9.34705 -7.42830 1.91875
magnitude: 2.61804 au
magnitude: 6.65454 debye
